BDBM50115356 4-(6,7-Dimethoxy-quinazolin-4-yl)-piperazine-1-carboxylic acid (2-chloro-phenyl)-amide::CHEMBL321504
SMILES: COc1cc2ncnc(N3CCN(CC3)C(=O)Nc3ccccc3Cl)c2cc1OC
InChI Key: InChIKey=GOVBQSNETQQWLT-UHFFFAOYSA-N
Data: 1 IC50
Activity Spreadsheet -- Enzyme Inhibition Constant Data from BindingDB
Found 1 hit for monomerid = 50115356
Trg + Lig
Ki
nM
ΔG°
kcal/mole
IC50
nM
Kd
nM
EC50/IC50
nM
koff
s-1
kon
M-1s-1
pHTemp
°C
Platelet-derived growth factor receptor beta
(Homo sapiens (Human))
BDBM50115356
(4-(6,7-Dimethoxy-quinazolin-4-yl)-piperazine-1-car...)
Show SMILES COc1cc2ncnc(N3CCN(CC3)C(=O)Nc3ccccc3Cl)c2cc1OC
Show InChI InChI=1S/C21H22ClN5O3/c1-29-18-11-14-17(12-19(18)30-2)23-13-24-20(14)26-7-9-27(10-8-26)21(28)25-16-6-4-3-5-15(16)22/h3-6,11-13H,7-10H2,1-2H3,(H,25,28)
NCI pathway
Reactome pathway
n/an/a>3.00E+4n/an/an/an/an/an/a
Pharmaceutical Research Institute
Curated by ChEMBL
Assay Description
Inhibition of Platelet-derived growth factor receptor beta phosphorylation
J Med Chem 45: 3057-66 (2002)
BindingDB Entry DOI: 10.7270/Q2RX9BDP