BDBM50115368 CHEMBL3609013
SMILES: OB(O)c1ccc(CN(Cc2ccccc2)c2ccc(cn2)C(=O)Nc2ccc(F)cc2)nc1
InChI Key: InChIKey=MXCRXBCGEWUMNZ-UHFFFAOYSA-N
Data: 2 IC50
Activity Spreadsheet -- Enzyme Inhibition Constant Data from BindingDB
Found 2 hits for monomerid = 50115368
Trg + Lig
Ki
nM
ΔG°
kcal/mole
IC50
nM
Kd
nM
EC50/IC50
nM
koff
s-1
kon
M-1s-1
pHTemp
°C
C-X-C chemokine receptor type 2
(Homo sapiens (Human))
BDBM50115368
(CHEMBL3609013)
Show SMILES OB(O)c1ccc(CN(Cc2ccccc2)c2ccc(cn2)C(=O)Nc2ccc(F)cc2)nc1
Show InChI InChI=1S/C25H22BFN4O3/c27-21-8-11-22(12-9-21)30-25(32)19-6-13-24(29-14-19)31(16-18-4-2-1-3-5-18)17-23-10-7-20(15-28-23)26(33)34/h1-15,33-34H,16-17H2,(H,30,32)
Reactome pathway
n/an/a 298n/an/an/an/an/an/a
Syntrix Biosystems
Curated by ChEMBL
Assay Description
Antagonist activity at CXCR2 (unknown origin) transfected in RBL cells assessed as inhibition of IL-8-mediated intracellular calcium release preincub...
Bioorg Med Chem Lett 25: 3793-7 (2015)
BindingDB Entry DOI: 10.7270/Q2V989VF
C-X-C chemokine receptor type 1
(Homo sapiens (Human))
BDBM50115368
(CHEMBL3609013)
Show SMILES OB(O)c1ccc(CN(Cc2ccccc2)c2ccc(cn2)C(=O)Nc2ccc(F)cc2)nc1
Show InChI InChI=1S/C25H22BFN4O3/c27-21-8-11-22(12-9-21)30-25(32)19-6-13-24(29-14-19)31(16-18-4-2-1-3-5-18)17-23-10-7-20(15-28-23)26(33)34/h1-15,33-34H,16-17H2,(H,30,32)
n/an/a 326n/an/an/an/an/an/a
Syntrix Biosystems
Curated by ChEMBL
Assay Description
Antagonist activity at CXCR1 (unknown origin) transfected in RBL cells assessed as inhibition of IL-8-mediated intracellular calcium release preincub...
Bioorg Med Chem Lett 25: 3793-7 (2015)
BindingDB Entry DOI: 10.7270/Q2V989VF