null
SMILES: ONC(=O)CCCCCCC(=O)N[C@@H](Cc1ccccc1)C(=O)NCCc1ccccc1
InChI Key: InChIKey=GQDFAIQHVHQOKG-QFIPXVFZSA-N
Activity Spreadsheet -- Enzyme Inhibition Constant Data from BindingDB
Found 3 hits for monomerid = 50115662
Trg + Lig
Ki
nM
ΔG°
kcal/mole
IC50
nM
Kd
nM
EC50/IC50
nM
koff
s-1
kon
M-1s-1
pHTemp
°C
Histone deacetylase 2b
(Zea mays)
BDBM50115662
(CHEMBL320038 | Octanedioic acid hydroxyamide ((S)-...)
Show SMILES ONC(=O)CCCCCCC(=O)N[C@@H](Cc1ccccc1)C(=O)NCCc1ccccc1
Show InChI InChI=1S/C25H33N3O4/c29-23(15-9-1-2-10-16-24(30)28-32)27-22(19-21-13-7-4-8-14-21)25(31)26-18-17-20-11-5-3-6-12-20/h3-8,11-14,22,32H,1-2,9-10,15-19H2,(H,26,31)(H,27,29)(H,28,30)/t22-/m0/s1
n/an/a 25n/an/an/an/an/an/a
Westfälische Wilhelms-Universität Münster
Curated by ChEMBL
Assay Description
Inhibition of in vitro enzyme activity measured in a highly purified maize Histone deacetylase 1 preparation
J Med Chem 45: 3296-309 (2002)
BindingDB Entry DOI: 10.7270/Q247497N
Histone deacetylase 2b
(Zea mays)
BDBM50115662
(CHEMBL320038 | Octanedioic acid hydroxyamide ((S)-...)
Show SMILES ONC(=O)CCCCCCC(=O)N[C@@H](Cc1ccccc1)C(=O)NCCc1ccccc1
Show InChI InChI=1S/C25H33N3O4/c29-23(15-9-1-2-10-16-24(30)28-32)27-22(19-21-13-7-4-8-14-21)25(31)26-18-17-20-11-5-3-6-12-20/h3-8,11-14,22,32H,1-2,9-10,15-19H2,(H,26,31)(H,27,29)(H,28,30)/t22-/m0/s1
n/an/a 330n/an/an/an/an/an/a
Aton Pharma, Inc
Curated by ChEMBL
Assay Description
Inhibitory concentration against maize Histone deacetylase 2
J Med Chem 46: 5097-116 (2003)
Article DOI: 10.1021/jm0303094
BindingDB Entry DOI: 10.7270/Q2MP5413
Histone deacetylase 2b
(Zea mays)
BDBM50115662
(CHEMBL320038 | Octanedioic acid hydroxyamide ((S)-...)
Show SMILES ONC(=O)CCCCCCC(=O)N[C@@H](Cc1ccccc1)C(=O)NCCc1ccccc1
Show InChI InChI=1S/C25H33N3O4/c29-23(15-9-1-2-10-16-24(30)28-32)27-22(19-21-13-7-4-8-14-21)25(31)26-18-17-20-11-5-3-6-12-20/h3-8,11-14,22,32H,1-2,9-10,15-19H2,(H,26,31)(H,27,29)(H,28,30)/t22-/m0/s1
n/an/a 330n/an/an/an/an/an/a
Westfälische Wilhelms-Universität Münster
Curated by ChEMBL
Assay Description
Inhibition of in vitro enzyme activity measured in a highly purified maize Histone deacetylase 2 preparation
J Med Chem 45: 3296-309 (2002)
BindingDB Entry DOI: 10.7270/Q247497N