BDBM50115912 4-[3-(4-Cyano-benzyl)-3H-imidazol-4-ylmethyl]-piperazine-1-carboxylic acid 2-ethoxy-pyridin-3-ylmethyl ester::CHEMBL418513
SMILES: CCOc1ncccc1COC(=O)N1CCN(Cc2cncn2Cc2ccc(cc2)C#N)CC1
InChI Key: InChIKey=QRZPLNXYFZWRNQ-UHFFFAOYSA-N
Data: 3 IC50
Activity Spreadsheet -- Enzyme Inhibition Constant Data from BindingDB
Found 3 hits for monomerid = 50115912
Trg + Lig
Ki
nM
ΔG°
kcal/mole
IC50
nM
Kd
nM
EC50/IC50
nM
koff
s-1
kon
M-1s-1
pHTemp
°C
Protein Farnesyltransferase (PFT)
(Homo sapiens (Human))
BDBM50115912
(4-[3-(4-Cyano-benzyl)-3H-imidazol-4-ylmethyl]-pipe...)
Show SMILES CCOc1ncccc1COC(=O)N1CCN(Cc2cncn2Cc2ccc(cc2)C#N)CC1
Show InChI InChI=1S/C25H28N6O3/c1-2-33-24-22(4-3-9-28-24)18-34-25(32)30-12-10-29(11-13-30)17-23-15-27-19-31(23)16-21-7-5-20(14-26)6-8-21/h3-9,15,19H,2,10-13,16-18H2,1H3
Reactome pathway
n/an/a 8.70n/an/an/an/an/an/a
Merck Research Laboratories
Curated by ChEMBL
Assay Description
The concentration required to displace 50% of a highly potent radiolabeled FPTase inhibitor
Bioorg Med Chem Lett 12: 2027-30 (2002)
BindingDB Entry DOI: 10.7270/Q2TQ60VS
Geranylgeranyl transferase type I beta subunit/Protein Farnesyltransferase (PFT)
(Homo sapiens (Human))
BDBM50115912
(4-[3-(4-Cyano-benzyl)-3H-imidazol-4-ylmethyl]-pipe...)
Show SMILES CCOc1ncccc1COC(=O)N1CCN(Cc2cncn2Cc2ccc(cc2)C#N)CC1
Show InChI InChI=1S/C25H28N6O3/c1-2-33-24-22(4-3-9-28-24)18-34-25(32)30-12-10-29(11-13-30)17-23-15-27-19-31(23)16-21-7-5-20(14-26)6-8-21/h3-9,15,19H,2,10-13,16-18H2,1H3
n/an/a 8.70n/an/an/an/an/an/a
Merck Research Laboratories
Curated by ChEMBL
Assay Description
Inhibition of [1-3H]-GGPP incorporation into biotinylated K4B-Ras peptide by geranylgeranyl transferase in the presence of 5 mM ATP
Bioorg Med Chem Lett 12: 2027-30 (2002)
BindingDB Entry DOI: 10.7270/Q2TQ60VS
Protein Farnesyltransferase (PFT)
(Homo sapiens (Human))
BDBM50115912
(4-[3-(4-Cyano-benzyl)-3H-imidazol-4-ylmethyl]-pipe...)
Show SMILES CCOc1ncccc1COC(=O)N1CCN(Cc2cncn2Cc2ccc(cc2)C#N)CC1
Show InChI InChI=1S/C25H28N6O3/c1-2-33-24-22(4-3-9-28-24)18-34-25(32)30-12-10-29(11-13-30)17-23-15-27-19-31(23)16-21-7-5-20(14-26)6-8-21/h3-9,15,19H,2,10-13,16-18H2,1H3
Reactome pathway
n/an/a 5n/an/an/an/an/an/a
Merck Research Laboratories
Curated by ChEMBL
Assay Description
Inhibitor of Farnesyl protein transferase(FTPase) required to reduce radiolabel [1-3H] incorporation by 50%
Bioorg Med Chem Lett 12: 2027-30 (2002)
BindingDB Entry DOI: 10.7270/Q2TQ60VS