BDBM50116037 3,5-Difluoro-4-[5-(4-fluoro-phenyl)-4-pyridin-4-yl-1H-pyrrol-2-yl]-pyridine-2,6-diamine::CHEMBL304523
SMILES: Nc1nc(N)c(F)c(-c2cc(c([nH]2)-c2ccc(F)cc2)-c2ccncc2)c1F
InChI Key: InChIKey=SJUWKYBAPVOBAH-UHFFFAOYSA-N
Data: 2 IC50
Activity Spreadsheet -- Enzyme Inhibition Constant Data from BindingDB
Found 2 hits for monomerid = 50116037
Trg + Lig
Ki
nM
ΔG°
kcal/mole
IC50
nM
Kd
nM
EC50/IC50
nM
koff
s-1
kon
M-1s-1
pHTemp
°C
Mitogen-activated protein kinase 14
(Mus musculus (mouse))
BDBM50116037
(3,5-Difluoro-4-[5-(4-fluoro-phenyl)-4-pyridin-4-yl...)
Show SMILES Nc1nc(N)c(F)c(-c2cc(c([nH]2)-c2ccc(F)cc2)-c2ccncc2)c1F
Show InChI InChI=1S/C20H14F3N5/c21-12-3-1-11(2-4-12)18-13(10-5-7-26-8-6-10)9-14(27-18)15-16(22)19(24)28-20(25)17(15)23/h1-9,27H,(H4,24,25,28)
Reactome pathway
n/an/a 4n/an/an/an/an/an/a
Novartis Pharma AG
Curated by ChEMBL
Assay Description
In vivo inhibition of murine Mitogen-activated protein kinase p38 alpha activity, GST-ATF-2 as substrate in the presence of 120 microM ATP
Bioorg Med Chem Lett 12: 2109-12 (2002)
BindingDB Entry DOI: 10.7270/Q2610ZNX
Prostaglandin G/H synthase 1
(Ovis aries (Sheep))
BDBM50116037
(3,5-Difluoro-4-[5-(4-fluoro-phenyl)-4-pyridin-4-yl...)
Show SMILES Nc1nc(N)c(F)c(-c2cc(c([nH]2)-c2ccc(F)cc2)-c2ccncc2)c1F
Show InChI InChI=1S/C20H14F3N5/c21-12-3-1-11(2-4-12)18-13(10-5-7-26-8-6-10)9-14(27-18)15-16(22)19(24)28-20(25)17(15)23/h1-9,27H,(H4,24,25,28)
n/an/a 6.30E+3n/an/an/an/an/an/a
Novartis Pharma AG
Curated by ChEMBL
Assay Description
In vivo inhibition of ram seminal vesicle Prostaglandin G/H synthase 1 activity by determining PGE-2 by RIA
Bioorg Med Chem Lett 12: 2109-12 (2002)
BindingDB Entry DOI: 10.7270/Q2610ZNX