BDBM50116250 2-[(3-Carboxy-3-{4-[(2,4-diamino-pteridin-6-ylmethyl)-methyl-amino]-benzoylamino}-propyl)-hydroxy-phosphinoyloxy]-pentanedioic acid::CHEMBL431954
SMILES: CN(Cc1cnc2nc(N)nc(N)c2n1)c1ccc(cc1)C(=O)N[C@@H](CCP(O)(=O)O[C@@H](CCC(O)=O)C(O)=O)C(O)=O
InChI Key: InChIKey=OXLXJCDNQPPJOQ-HOTGVXAUSA-N
Data: 2 IC50
Activity Spreadsheet -- Enzyme Inhibition Constant Data from BindingDB
Found 2 hits for monomerid = 50116250
Trg + Lig
Ki
nM
ΔG°
kcal/mole
IC50
nM
Kd
nM
EC50/IC50
nM
koff
s-1
kon
M-1s-1
pHTemp
°C
Glutamate carboxypeptidase II
(Rattus norvegicus)
BDBM50116250
(2-[(3-Carboxy-3-{4-[(2,4-diamino-pteridin-6-ylmeth...)
Show SMILES CN(Cc1cnc2nc(N)nc(N)c2n1)c1ccc(cc1)C(=O)N[C@@H](CCP(O)(=O)O[C@@H](CCC(O)=O)C(O)=O)C(O)=O
Show InChI InChI=1S/C24H29N8O10P/c1-32(11-13-10-27-20-18(28-13)19(25)30-24(26)31-20)14-4-2-12(3-5-14)21(35)29-15(22(36)37)8-9-43(40,41)42-16(23(38)39)6-7-17(33)34/h2-5,10,15-16H,6-9,11H2,1H3,(H,29,35)(H,33,34)(H,36,37)(H,38,39)(H,40,41)(H4,25,26,27,30,31)/t15-,16-/m0/s1
n/an/a 4n/an/an/an/an/an/a
Guilford Pharmaceuticals Inc.
Curated by ChEMBL
Assay Description
Compound was evaluated for its ability to inhibit Glutamate carboxypeptidase-II using N-acetyl-L-aspartyl-[3H]-L-glutamate as substrate
Bioorg Med Chem Lett 12: 2189-92 (2002)
BindingDB Entry DOI: 10.7270/Q21835TN
Folylpoly-gamma-glutamate synthetase
(Homo sapiens (Human))
BDBM50116250
(2-[(3-Carboxy-3-{4-[(2,4-diamino-pteridin-6-ylmeth...)
Show SMILES CN(Cc1cnc2nc(N)nc(N)c2n1)c1ccc(cc1)C(=O)N[C@@H](CCP(O)(=O)O[C@@H](CCC(O)=O)C(O)=O)C(O)=O
Show InChI InChI=1S/C24H29N8O10P/c1-32(11-13-10-27-20-18(28-13)19(25)30-24(26)31-20)14-4-2-12(3-5-14)21(35)29-15(22(36)37)8-9-43(40,41)42-16(23(38)39)6-7-17(33)34/h2-5,10,15-16H,6-9,11H2,1H3,(H,29,35)(H,33,34)(H,36,37)(H,38,39)(H,40,41)(H4,25,26,27,30,31)/t15-,16-/m0/s1
Reactome pathway
n/an/a 120n/an/an/an/an/an/a
Guilford Pharmaceuticals Inc.
Curated by ChEMBL
Assay Description
Compound was evaluated for its ability to inhibit Folylpoly-gamma-glutamyl synthetase
Bioorg Med Chem Lett 12: 2189-92 (2002)
BindingDB Entry DOI: 10.7270/Q21835TN