BDBM50116402 2-(2,6-Dichloro-phenylamino)-6,6-dimethyl-1,6-dihydro-imidazo[4,5-h]isoquinoline-7,9-dione::CHEMBL330903
SMILES: CC1(C)C(=O)NC(=O)c2c1ccc1nc(Nc3c(Cl)cccc3Cl)[nH]c21
InChI Key: InChIKey=OHDGUYABCZECFT-UHFFFAOYSA-N
Data: 1 IC50
Activity Spreadsheet -- Enzyme Inhibition Constant Data from BindingDB
Found 1 hit for monomerid = 50116402
Trg + Lig
Ki
nM
ΔG°
kcal/mole
IC50
nM
Kd
nM
EC50/IC50
nM
koff
s-1
kon
M-1s-1
pHTemp
°C
Tyrosine-protein kinase Lck
(Homo sapiens (Human))
BDBM50116402
(2-(2,6-Dichloro-phenylamino)-6,6-dimethyl-1,6-dihy...)
Show SMILES CC1(C)C(=O)NC(=O)c2c1ccc1nc(Nc3c(Cl)cccc3Cl)[nH]c21
Show InChI InChI=1S/C18H14Cl2N4O2/c1-18(2)8-6-7-11-14(12(8)15(25)24-16(18)26)23-17(21-11)22-13-9(19)4-3-5-10(13)20/h3-7H,1-2H3,(H2,21,22,23)(H,24,25,26)
n/an/a 460n/an/an/an/an/an/a
Boehringer Ingelheim Pharmaceuticals Inc.
Curated by ChEMBL
Assay Description
Inhibitory activity against recombinant human p56 Lck tyrosine kinase
J Med Chem 45: 3394-405 (2002)
BindingDB Entry DOI: 10.7270/Q2CJ8CTW