null
SMILES: CC(C)n1c2ccccc2c2c(F)c(NC(=O)N3CCOCC3)c(F)cc12
InChI Key: InChIKey=RTALAECPNZHYMK-UHFFFAOYSA-N
Activity Spreadsheet -- Enzyme Inhibition Constant Data from BindingDB
Found 1 hit for monomerid = 50116607
Trg + Lig
Ki
nM
ΔG°
kcal/mole
IC50
nM
Kd
nM
EC50/IC50
nM
koff
s-1
kon
M-1s-1
pHTemp
°C
Neuropeptide Y receptor type 5
(Homo sapiens (Human))
BDBM50116607
(CHEMBL325639 | Morpholine-4-carboxylic acid (2,4-d...)
Show SMILES CC(C)n1c2ccccc2c2c(F)c(NC(=O)N3CCOCC3)c(F)cc12
Show InChI InChI=1S/C20H21F2N3O2/c1-12(2)25-15-6-4-3-5-13(15)17-16(25)11-14(21)19(18(17)22)23-20(26)24-7-9-27-10-8-24/h3-6,11-12H,7-10H2,1-2H3,(H,23,26)
n/an/a 12n/an/an/an/an/an/a
AstraZeneca
Curated by ChEMBL
Assay Description
Binding affinity to the human Neuropeptide Y receptor Y5 (NPY5)
J Med Chem 45: 3509-23 (2002)
BindingDB Entry DOI: 10.7270/Q27S7N3K