null
SMILES: CC(C)n1c2ccccc2c2cc(NC(=O)CCc3ccncc3)ccc12
InChI Key: InChIKey=ISOORHISZYRNCF-UHFFFAOYSA-N
Activity Spreadsheet -- Enzyme Inhibition Constant Data from BindingDB
Found 1 hit for monomerid = 50116610
Trg + Lig
Ki
nM
ΔG°
kcal/mole
IC50
nM
Kd
nM
EC50/IC50
nM
koff
s-1
kon
M-1s-1
pHTemp
°C
Neuropeptide Y receptor type 5
(Homo sapiens (Human))
BDBM50116610
(CHEMBL119743 | N-(9-Isopropyl-9H-carbazol-3-yl)-3-...)
Show SMILES CC(C)n1c2ccccc2c2cc(NC(=O)CCc3ccncc3)ccc12
Show InChI InChI=1S/C23H23N3O/c1-16(2)26-21-6-4-3-5-19(21)20-15-18(8-9-22(20)26)25-23(27)10-7-17-11-13-24-14-12-17/h3-6,8-9,11-16H,7,10H2,1-2H3,(H,25,27)
n/an/a 1n/an/an/an/an/an/a
AstraZeneca
Curated by ChEMBL
Assay Description
Binding affinity to the human Neuropeptide Y receptor Y5 (NPY5)
J Med Chem 45: 3509-23 (2002)
BindingDB Entry DOI: 10.7270/Q27S7N3K