BDBM50116702 CHEMBL3608697
SMILES: COc1ccc(O)c(c1)C(=O)Nc1cccc(Cl)c1
InChI Key: InChIKey=HZCXJTZFWWWHFF-UHFFFAOYSA-N
Data: 1 IC50
Activity Spreadsheet -- Enzyme Inhibition Constant Data from BindingDB
Found 1 hit for monomerid = 50116702
Trg + Lig
Ki
nM
ΔG°
kcal/mole
IC50
nM
Kd
nM
EC50/IC50
nM
koff
s-1
kon
M-1s-1
pHTemp
°C
Acyl-CoA (8-3)-desaturase
(Homo sapiens (Human))
BDBM50116702
(CHEMBL3608697)
Show SMILES COc1ccc(O)c(c1)C(=O)Nc1cccc(Cl)c1
Show InChI InChI=1S/C14H12ClNO3/c1-19-11-5-6-13(17)12(8-11)14(18)16-10-4-2-3-9(15)7-10/h2-8,17H,1H3,(H,16,18)
Reactome pathway
n/an/a 15n/an/an/an/an/an/a
Lexicon Pharmaceuticals
Curated by ChEMBL
Assay Description
Inhibition of liver delta-5 desaturase (unknown origin)
Bioorg Med Chem Lett 25: 3836-9 (2015)
BindingDB Entry DOI: 10.7270/Q2MP552Z