BDBM50116905 CHEMBL3613023
SMILES: CC(=O)Oc1ccc(\C=C\C(=O)OCCC#C)cc1OC(C)=O
InChI Key: InChIKey=RVLQODIVTXFDKD-VQHVLOKHSA-N
Data: 2 IC50
Activity Spreadsheet -- Enzyme Inhibition Constant Data from BindingDB
Found 2 hits for monomerid = 50116905
Trg + Lig
Ki
nM
ΔG°
kcal/mole
IC50
nM
Kd
nM
EC50/IC50
nM
koff
s-1
kon
M-1s-1
pHTemp
°C
Arachidonate 5-lipoxygenase
(Homo sapiens (Human))
BDBM50116905
(CHEMBL3613023)
Show SMILES CC(=O)Oc1ccc(\C=C\C(=O)OCCC#C)cc1OC(C)=O
Show InChI InChI=1S/C17H16O6/c1-4-5-10-21-17(20)9-7-14-6-8-15(22-12(2)18)16(11-14)23-13(3)19/h1,6-9,11H,5,10H2,2-3H3/b9-7+
Reactome pathway
n/an/a>1.00E+4n/an/an/an/an/an/a
University of Ferrara
Curated by ChEMBL
Assay Description
Inhibition of 5-LOX in human neutrophils assessed as reduction in LTB4 and 5-H(P)ETE) formation pre-incubated for 15 mins before A23187 and arachidon...
Eur J Med Chem 101: 573-83 (2015)
BindingDB Entry DOI: 10.7270/Q2V69MDP
Arachidonate 5-lipoxygenase
(Homo sapiens (Human))
BDBM50116905
(CHEMBL3613023)
Show SMILES CC(=O)Oc1ccc(\C=C\C(=O)OCCC#C)cc1OC(C)=O
Show InChI InChI=1S/C17H16O6/c1-4-5-10-21-17(20)9-7-14-6-8-15(22-12(2)18)16(11-14)23-13(3)19/h1,6-9,11H,5,10H2,2-3H3/b9-7+
Reactome pathway
n/an/a 1.80E+3n/an/an/an/an/an/a
University of Ferrara
Curated by ChEMBL
Assay Description
Inhibition of human 5-LOX expressed in Escherichia coli Bl21 (DE3) assessed as reduction in LTB4 and 5-H(P)ETE) formation pre-incubated for 10 mins b...
Eur J Med Chem 101: 573-83 (2015)
BindingDB Entry DOI: 10.7270/Q2V69MDP