BDBM50116914 (S)-4-(1-Furo[3,2-c]pyridin-2-yl-1-methyl-ethyl)-1-[(2S,4R)-2-hydroxy-4-((1S,2R)-2-hydroxy-indan-1-ylcarbamoyl)-5-phenyl-pentyl]-piperazine-2-carboxylic acid tert-butylamide::CHEMBL78876
SMILES: CC(C)(C)NC(=O)[C@@H]1CN(CCN1C[C@@H](O)C[C@@H](Cc1ccccc1)C(=O)N[C@@H]1[C@H](O)Cc2ccccc12)C(C)(C)c1cc2cnccc2o1
InChI Key: InChIKey=WPNGOVIGRGIGBK-SJOQPYOASA-N
Data: 1 IC50
Activity Spreadsheet -- Enzyme Inhibition Constant Data from BindingDB
Found 1 hit for monomerid = 50116914
Trg + Lig
Ki
nM
ΔG°
kcal/mole
IC50
nM
Kd
nM
EC50/IC50
nM
koff
s-1
kon
M-1s-1
pHTemp
°C
Human immunodeficiency virus type 1 protease
(Human immunodeficiency virus type 1)
BDBM50116914
((S)-4-(1-Furo[3,2-c]pyridin-2-yl-1-methyl-ethyl)-1...)
Show SMILES CC(C)(C)NC(=O)[C@@H]1CN(CCN1C[C@@H](O)C[C@@H](Cc1ccccc1)C(=O)N[C@@H]1[C@H](O)Cc2ccccc12)C(C)(C)c1cc2cnccc2o1
Show InChI InChI=1S/C40H51N5O5/c1-39(2,3)43-38(49)32-25-45(40(4,5)35-22-29-23-41-16-15-34(29)50-35)18-17-44(32)24-30(46)20-28(19-26-11-7-6-8-12-26)37(48)42-36-31-14-10-9-13-27(31)21-33(36)47/h6-16,22-23,28,30,32-33,36,46-47H,17-21,24-25H2,1-5H3,(H,42,48)(H,43,49)/t28-,30+,32+,33-,36+/m1/s1
n/an/a 0.150n/an/an/an/an/an/a
Merck Research Laboratories
Curated by ChEMBL
Assay Description
Inhibitory concentration required to inhibit cleavage of a substrate by the wild-type HIV-1 Protease
Bioorg Med Chem Lett 12: 2419-22 (2002)
BindingDB Entry DOI: 10.7270/Q2PV6JQR