null
SMILES: Cn1nnnc1-c1ccc(CC2(CCC2)C(=O)N[C@@H](Cc2ccc(NC(=O)c3c(Cl)cccc3Cl)cc2)C(O)=O)cc1
InChI Key: InChIKey=BESXQTSZSXTMFO-DEOSSOPVSA-N
Activity Spreadsheet -- Enzyme Inhibition Constant Data from BindingDB
Found 2 hits for monomerid = 50117000
Trg + Lig
Ki
nM
ΔG°
kcal/mole
IC50
nM
Kd
nM
EC50/IC50
nM
koff
s-1
kon
M-1s-1
pHTemp
°C
Integrin alpha-4/beta-1
(Homo sapiens (Human))
BDBM50117000
((S)-3-[4-(2,6-Dichloro-benzoylamino)-phenyl]-2-({1...)
Show SMILES Cn1nnnc1-c1ccc(CC2(CCC2)C(=O)N[C@@H](Cc2ccc(NC(=O)c3c(Cl)cccc3Cl)cc2)C(O)=O)cc1
Show InChI InChI=1S/C30H28Cl2N6O4/c1-38-26(35-36-37-38)20-10-6-19(7-11-20)17-30(14-3-15-30)29(42)34-24(28(40)41)16-18-8-12-21(13-9-18)33-27(39)25-22(31)4-2-5-23(25)32/h2,4-13,24H,3,14-17H2,1H3,(H,33,39)(H,34,42)(H,40,41)/t24-/m0/s1
Reactome pathway
n/an/a 0.420n/an/an/an/an/an/a
Roche Research Center
Curated by ChEMBL
Assay Description
Inhibitory binding concentration determined against VCAM/VLA-4 in ELISA
Bioorg Med Chem Lett 12: 2475-8 (2002)
BindingDB Entry DOI: 10.7270/Q2251HH8
Integrin alpha-4/beta-1
(Homo sapiens (Human))
BDBM50117000
((S)-3-[4-(2,6-Dichloro-benzoylamino)-phenyl]-2-({1...)
Show SMILES Cn1nnnc1-c1ccc(CC2(CCC2)C(=O)N[C@@H](Cc2ccc(NC(=O)c3c(Cl)cccc3Cl)cc2)C(O)=O)cc1
Show InChI InChI=1S/C30H28Cl2N6O4/c1-38-26(35-36-37-38)20-10-6-19(7-11-20)17-30(14-3-15-30)29(42)34-24(28(40)41)16-18-8-12-21(13-9-18)33-27(39)25-22(31)4-2-5-23(25)32/h2,4-13,24H,3,14-17H2,1H3,(H,33,39)(H,34,42)(H,40,41)/t24-/m0/s1
Reactome pathway
n/an/a 27n/an/an/an/an/an/a
Roche Research Center
Curated by ChEMBL
Assay Description
Inhibitory binding concentration determined against VCAM/VLA-4 in Ramos
Bioorg Med Chem Lett 12: 2475-8 (2002)
BindingDB Entry DOI: 10.7270/Q2251HH8