BDBM50117220 5-Ethyl-8-phenyl-3H-[1,2,4]triazolo[5,1-i]purine::CHEMBL330873
SMILES: CCc1nc2nc[nH]c2c2nc(nn12)-c1ccccc1
InChI Key: InChIKey=ZHYRTKIVUDZAJQ-UHFFFAOYSA-N
Data: 2 IC50
Activity Spreadsheet -- Enzyme Inhibition Constant Data from BindingDB
Found 2 hits for monomerid = 50117220
Trg + Lig
Ki
nM
ΔG°
kcal/mole
IC50
nM
Kd
nM
EC50/IC50
nM
koff
s-1
kon
M-1s-1
pHTemp
°C
Adenosine receptor A2a
(Homo sapiens (Human))
BDBM50117220
(5-Ethyl-8-phenyl-3H-[1,2,4]triazolo[5,1-i]purine |...)
Show SMILES CCc1nc2nc[nH]c2c2nc(nn12)-c1ccccc1
Show InChI InChI=1S/C14H12N6/c1-2-10-17-13-11(15-8-16-13)14-18-12(19-20(10)14)9-6-4-3-5-7-9/h3-8H,2H2,1H3,(H,15,16)
NCI pathway
Reactome pathway
n/an/a 360n/an/an/an/an/an/a
Nutrition Research Institute
Curated by ChEMBL
Assay Description
Displacement of [3H]-CGS-21,680 binding to human Adenosine A2A receptor expressed in HEK-293 cells
J Med Chem 45: 3703-8 (2002)
BindingDB Entry DOI: 10.7270/Q2154GCW
Adenosine receptor A3
(Homo sapiens (Human))
BDBM50117220
(5-Ethyl-8-phenyl-3H-[1,2,4]triazolo[5,1-i]purine |...)
Show SMILES CCc1nc2nc[nH]c2c2nc(nn12)-c1ccccc1
Show InChI InChI=1S/C14H12N6/c1-2-10-17-13-11(15-8-16-13)14-18-12(19-20(10)14)9-6-4-3-5-7-9/h3-8H,2H2,1H3,(H,15,16)
Reactome pathway
n/an/a 0.450n/an/an/an/an/an/a
Nutrition Research Institute
Curated by ChEMBL
Assay Description
Displacement of [125I]-AB-MECA binding to human Adenosine A3 receptor expressed in HEK-293 cells
J Med Chem 45: 3703-8 (2002)
BindingDB Entry DOI: 10.7270/Q2154GCW