BDBM50117603 1-Allyl-4-[3-(5,6-dimethoxy-benzo[b]thiophen-2-yl)-3-oxo-propyl]-pyridinium; bromide::CHEMBL87980
SMILES: COc1cc2cc(sc2cc1OC)C(=O)CCc1cc[n+](CC=C)cc1
InChI Key: InChIKey=JFIAJOKWMHWGNB-UHFFFAOYSA-N
Data: 1 IC50  1 EC50
Activity Spreadsheet -- Enzyme Inhibition Constant Data from BindingDB
Found 2 hits for monomerid = 50117603
Trg + Lig
Ki
nM
ΔG°
kcal/mole
IC50
nM
Kd
nM
EC50/IC50
nM
koff
s-1
kon
M-1s-1
pHTemp
°C
Acetylcholinesterase
(Homo sapiens (Human))
BDBM50117603
(1-Allyl-4-[3-(5,6-dimethoxy-benzo[b]thiophen-2-yl)...)
Show SMILES COc1cc2cc(sc2cc1OC)C(=O)CCc1cc[n+](CC=C)cc1
Show InChI InChI=1S/C21H22NO3S/c1-4-9-22-10-7-15(8-11-22)5-6-17(23)21-13-16-12-18(24-2)19(25-3)14-20(16)26-21/h4,7-8,10-14H,1,5-6,9H2,2-3H3/q+1
NCI pathway
Reactome pathway
n/an/a 540n/an/an/an/an/an/a
Organon Laboratories Ltd.
Curated by ChEMBL
Assay Description
In vitro reversal of vecuronium-induced block in isolated guinea pig hemi-diaphragm.
Bioorg Med Chem Lett 12: 2569-72 (2002)
BindingDB Entry DOI: 10.7270/Q28916C0
Acetylcholinesterase
(Homo sapiens (Human))
BDBM50117603
(1-Allyl-4-[3-(5,6-dimethoxy-benzo[b]thiophen-2-yl)...)
Show SMILES COc1cc2cc(sc2cc1OC)C(=O)CCc1cc[n+](CC=C)cc1
Show InChI InChI=1S/C21H22NO3S/c1-4-9-22-10-7-15(8-11-22)5-6-17(23)21-13-16-12-18(24-2)19(25-3)14-20(16)26-21/h4,7-8,10-14H,1,5-6,9H2,2-3H3/q+1
NCI pathway
Reactome pathway
n/an/an/an/a>3.00E+3n/an/an/an/a
Organon Laboratories Ltd.
Curated by ChEMBL
Assay Description
In vitro reversal of vecuronium-induced block in isolated guinea pig hemi-diaphragm.
Bioorg Med Chem Lett 12: 2569-72 (2002)
BindingDB Entry DOI: 10.7270/Q28916C0