BDBM50117610 1-Benzyl-4-[(5,6-dimethoxy-benzo[b]thiophen-2-yl)-hydroxy-methyl]-1-methyl-piperidinium; bromide::CHEMBL85473
SMILES: COc1cc2cc(sc2cc1OC)C(O)C1CC[N+](C)(Cc2ccccc2)CC1
InChI Key: InChIKey=MLFLAFFZWZJJPF-UHFFFAOYSA-N
Data: 1 IC50  1 EC50
Activity Spreadsheet -- Enzyme Inhibition Constant Data from BindingDB
Found 2 hits for monomerid = 50117610
Trg + Lig
Ki
nM
ΔG°
kcal/mole
IC50
nM
Kd
nM
EC50/IC50
nM
koff
s-1
kon
M-1s-1
pHTemp
°C
Acetylcholinesterase
(Homo sapiens (Human))
BDBM50117610
(1-Benzyl-4-[(5,6-dimethoxy-benzo[b]thiophen-2-yl)-...)
Show SMILES COc1cc2cc(sc2cc1OC)C(O)C1CC[N+](C)(Cc2ccccc2)CC1 |(3.16,-1.52,;4.48,-.75,;5.81,-1.52,;7.12,-.75,;8.45,-1.52,;9.94,-1.03,;10.85,-2.29,;9.94,-3.55,;8.45,-3.06,;7.14,-3.83,;5.81,-3.06,;4.48,-3.83,;3.16,-3.06,;12.39,-2.29,;13.16,-3.62,;13.14,-.96,;14.68,-.79,;15.29,.62,;14.38,1.86,;13.17,2.82,;14.99,3.26,;16.53,3.43,;17.44,2.19,;18.97,2.37,;19.58,3.78,;18.65,5.02,;17.13,4.85,;12.84,1.68,;12.23,.27,)|
Show InChI InChI=1S/C24H30NO3S/c1-25(16-17-7-5-4-6-8-17)11-9-18(10-12-25)24(26)23-14-19-13-20(27-2)21(28-3)15-22(19)29-23/h4-8,13-15,18,24,26H,9-12,16H2,1-3H3/q+1
NCI pathway
Reactome pathway
n/an/a 1.96E+4n/an/an/an/an/an/a
Organon Laboratories Ltd.
Curated by ChEMBL
Assay Description
Concentration required for the inhibition of acetylcholinesterase
Bioorg Med Chem Lett 12: 2569-72 (2002)
BindingDB Entry DOI: 10.7270/Q28916C0
Acetylcholinesterase
(Homo sapiens (Human))
BDBM50117610
(1-Benzyl-4-[(5,6-dimethoxy-benzo[b]thiophen-2-yl)-...)
Show SMILES COc1cc2cc(sc2cc1OC)C(O)C1CC[N+](C)(Cc2ccccc2)CC1 |(3.16,-1.52,;4.48,-.75,;5.81,-1.52,;7.12,-.75,;8.45,-1.52,;9.94,-1.03,;10.85,-2.29,;9.94,-3.55,;8.45,-3.06,;7.14,-3.83,;5.81,-3.06,;4.48,-3.83,;3.16,-3.06,;12.39,-2.29,;13.16,-3.62,;13.14,-.96,;14.68,-.79,;15.29,.62,;14.38,1.86,;13.17,2.82,;14.99,3.26,;16.53,3.43,;17.44,2.19,;18.97,2.37,;19.58,3.78,;18.65,5.02,;17.13,4.85,;12.84,1.68,;12.23,.27,)|
Show InChI InChI=1S/C24H30NO3S/c1-25(16-17-7-5-4-6-8-17)11-9-18(10-12-25)24(26)23-14-19-13-20(27-2)21(28-3)15-22(19)29-23/h4-8,13-15,18,24,26H,9-12,16H2,1-3H3/q+1
NCI pathway
Reactome pathway
n/an/an/an/a>3.00E+4n/an/an/an/a
Organon Laboratories Ltd.
Curated by ChEMBL
Assay Description
In vitro reversal of vecuronium-induced block in isolated guinea pig hemi-diaphragm.
Bioorg Med Chem Lett 12: 2569-72 (2002)
BindingDB Entry DOI: 10.7270/Q28916C0