BDBM50117717 3-Isobutyl-8-(2-isopropoxy-phenyl)-1-methyl-3,7-dihydro-purine-2,6-dione::CHEMBL314667
SMILES: CC(C)Cn1c2nc([nH]c2c(=O)n(C)c1=O)-c1ccccc1OC(C)C
InChI Key: InChIKey=LABTVQUPSPQYOL-UHFFFAOYSA-N
Data: 2 IC50
Activity Spreadsheet -- Enzyme Inhibition Constant Data from BindingDB
Found 2 hits for monomerid = 50117717
Trg + Lig
Ki
nM
ΔG°
kcal/mole
IC50
nM
Kd
nM
EC50/IC50
nM
koff
s-1
kon
M-1s-1
pHTemp
°C
Phosphodiesterase 6
(Bos taurus-Bos taurus (Bovine))
BDBM50117717
(3-Isobutyl-8-(2-isopropoxy-phenyl)-1-methyl-3,7-di...)
Show SMILES CC(C)Cn1c2nc([nH]c2c(=O)n(C)c1=O)-c1ccccc1OC(C)C
Show InChI InChI=1S/C19H24N4O3/c1-11(2)10-23-17-15(18(24)22(5)19(23)25)20-16(21-17)13-8-6-7-9-14(13)26-12(3)4/h6-9,11-12H,10H2,1-5H3,(H,20,21)
n/an/a 214n/an/an/an/an/an/a
Novartis Horsham Research Centre
Curated by ChEMBL
Assay Description
Inhibitory concentration against bovine retina phosphodiesterase 6 activity
Bioorg Med Chem Lett 12: 2587-90 (2002)
BindingDB Entry DOI: 10.7270/Q2KW5FC2
cGMP-specific 3',5'-cyclic phosphodiesterase
(Homo sapiens (Human))
BDBM50117717
(3-Isobutyl-8-(2-isopropoxy-phenyl)-1-methyl-3,7-di...)
Show SMILES CC(C)Cn1c2nc([nH]c2c(=O)n(C)c1=O)-c1ccccc1OC(C)C
Show InChI InChI=1S/C19H24N4O3/c1-11(2)10-23-17-15(18(24)22(5)19(23)25)20-16(21-17)13-8-6-7-9-14(13)26-12(3)4/h6-9,11-12H,10H2,1-5H3,(H,20,21)
Reactome pathway
n/an/a 77n/an/an/an/an/an/a
Novartis Horsham Research Centre
Curated by ChEMBL
Assay Description
Inhibitory activity against human platelet Phosphodiesterase 5 (PDE5)
Bioorg Med Chem Lett 12: 2587-90 (2002)
BindingDB Entry DOI: 10.7270/Q2KW5FC2