null
SMILES: CC(C)Cn1c2nc([nH]c2c(=O)n(C)c1=O)-c1cc(ccc1OC(C)C)S(=O)(=O)N1CCN(C)CC1
InChI Key: InChIKey=ISOBGAUMEBQSDA-UHFFFAOYSA-N
Activity Spreadsheet -- Enzyme Inhibition Constant Data from BindingDB
Found 2 hits for monomerid = 50117732
Trg + Lig
Ki
nM
ΔG°
kcal/mole
IC50
nM
Kd
nM
EC50/IC50
nM
koff
s-1
kon
M-1s-1
pHTemp
°C
P04972/P11541/P16586/P22571/P23439/Q95142
(Bos taurus-Bos taurus (Bovine))
BDBM50117732
(3-Isobutyl-8-[2-isopropoxy-5-(4-methyl-piperazine-...)
Show SMILES CC(C)Cn1c2nc([nH]c2c(=O)n(C)c1=O)-c1cc(ccc1OC(C)C)S(=O)(=O)N1CCN(C)CC1
Show InChI InChI=1S/C24H34N6O5S/c1-15(2)14-30-22-20(23(31)28(6)24(30)32)25-21(26-22)18-13-17(7-8-19(18)35-16(3)4)36(33,34)29-11-9-27(5)10-12-29/h7-8,13,15-16H,9-12,14H2,1-6H3,(H,25,26)
n/an/a 77n/an/an/an/an/an/a
Novartis Horsham Research Centre
Curated by ChEMBL
Assay Description
Inhibitory concentration against bovine retina phosphodiesterase 6 activity
Bioorg Med Chem Lett 12: 2587-90 (2002)
BindingDB Entry DOI: 10.7270/Q2KW5FC2
cGMP-specific 3',5'-cyclic phosphodiesterase
(Homo sapiens (Human))
BDBM50117732
(3-Isobutyl-8-[2-isopropoxy-5-(4-methyl-piperazine-...)
Show SMILES CC(C)Cn1c2nc([nH]c2c(=O)n(C)c1=O)-c1cc(ccc1OC(C)C)S(=O)(=O)N1CCN(C)CC1
Show InChI InChI=1S/C24H34N6O5S/c1-15(2)14-30-22-20(23(31)28(6)24(30)32)25-21(26-22)18-13-17(7-8-19(18)35-16(3)4)36(33,34)29-11-9-27(5)10-12-29/h7-8,13,15-16H,9-12,14H2,1-6H3,(H,25,26)
Reactome pathway
n/an/a 16n/an/an/an/an/an/a
Novartis Horsham Research Centre
Curated by ChEMBL
Assay Description
Inhibitory activity against human platelet Phosphodiesterase 5 (PDE5)
Bioorg Med Chem Lett 12: 2587-90 (2002)
BindingDB Entry DOI: 10.7270/Q2KW5FC2