BDBM50117743 CHEMBL3613790
SMILES: CC1(C)CN=C(S1)N1CCN(CC1)c1ncnc2sc(cc12)C(F)(F)C(F)(F)F
InChI Key: InChIKey=GFFCPACLFKCZTI-UHFFFAOYSA-N
Data: 1 IC50
PDB links: 1 PDB ID matches this monomer.
Activity Spreadsheet -- Enzyme Inhibition Constant Data from BindingDB
Found 1 hit for monomerid = 50117743
Trg + Lig
Ki
nM
ΔG°
kcal/mole
IC50
nM
Kd
nM
EC50/IC50
nM
koff
s-1
kon
M-1s-1
pHTemp
°C
Menin
(Homo sapiens (Human))
BDBM50117743
(CHEMBL3613790)
Show SMILES CC1(C)CN=C(S1)N1CCN(CC1)c1ncnc2sc(cc12)C(F)(F)C(F)(F)F |c:4|
Show InChI InChI=1S/C17H18F5N5S2/c1-15(2)8-23-14(29-15)27-5-3-26(4-6-27)12-10-7-11(16(18,19)17(20,21)22)28-13(10)25-9-24-12/h7,9H,3-6,8H2,1-2H3
n/an/a 674n/an/an/an/an/an/a
University of Michigan
Curated by ChEMBL
Assay Description
Inhibition of N-terminal thioredoxin His6-tagged full-length human menin expressed in Escherichia coli Rosetta (DE3) cells assessed as reduction in m...
J Med Chem 58: 7465-74 (2015)
BindingDB Entry DOI: 10.7270/Q25H7J2H
3D
3D Structure (crystal)