BDBM50117788 CHEMBL407553::N-(4'-Chloro-biphenyl-4-ylmethyl)-N-{2-[ethyl-(2-hydroxy-ethyl)-amino]-ethyl}-2-[2-(4-fluoro-benzylsulfanyl)-5-(1-methyl-1H-pyrazol-4-ylmethyl)-4-oxo-4H-pyrimidin-1-yl]-acetamide
SMILES: CCN(CCO)CCN(Cc1ccc(cc1)-c1ccc(Cl)cc1)C(=O)Cn1cc(Cc2cnn(C)c2)c(=O)nc1SCc1ccc(F)cc1
InChI Key: InChIKey=IYWLLEISTIXAQH-UHFFFAOYSA-N
Data: 1 IC50
Activity Spreadsheet -- Enzyme Inhibition Constant Data from BindingDB
Found 1 hit for monomerid = 50117788
Trg + Lig
Ki
nM
ΔG°
kcal/mole
IC50
nM
Kd
nM
EC50/IC50
nM
koff
s-1
kon
M-1s-1
pHTemp
°C
LDL-associated phospholipase A2
(Homo sapiens (Human))
BDBM50117788
(CHEMBL407553 | N-(4'-Chloro-biphenyl-4-ylmethyl)-N...)
Show SMILES CCN(CCO)CCN(Cc1ccc(cc1)-c1ccc(Cl)cc1)C(=O)Cn1cc(Cc2cnn(C)c2)c(=O)nc1SCc1ccc(F)cc1
Show InChI InChI=1S/C37H40ClFN6O3S/c1-3-43(18-19-46)16-17-44(23-27-4-8-30(9-5-27)31-10-12-33(38)13-11-31)35(47)25-45-24-32(20-29-21-40-42(2)22-29)36(48)41-37(45)49-26-28-6-14-34(39)15-7-28/h4-15,21-22,24,46H,3,16-20,23,25-26H2,1-2H3
NCI pathway
Reactome pathway
n/an/a 0.120n/an/an/an/an/an/a
GlaxoSmithKline
Curated by ChEMBL
Assay Description
Inhibitory concentration against Lipoprotein-Associated Phospholipase A2 (Lp-PLA2) was estimated
Bioorg Med Chem Lett 12: 2603-6 (2002)
BindingDB Entry DOI: 10.7270/Q2G44PNN