BDBM50117886 CHEMBL3612603
SMILES: CCC(=O)NCC1CCc2c(OC)cccc2N1C
InChI Key: InChIKey=ZSELWOXQYWTXNS-UHFFFAOYSA-N
Data: 1 KI  1 EC50
Activity Spreadsheet -- Enzyme Inhibition Constant Data from BindingDB
Found 2 hits for monomerid = 50117886
Trg + Lig
Ki
nM
ΔG°
kcal/mole
IC50
nM
Kd
nM
EC50/IC50
nM
koff
s-1
kon
M-1s-1
pHTemp
°C
Melatonin receptor
(Homo sapiens (Human))
BDBM50117886
(CHEMBL3612603)
Show SMILES CCC(=O)NCC1CCc2c(OC)cccc2N1C
Show InChI InChI=1S/C15H22N2O2/c1-4-15(18)16-10-11-8-9-12-13(17(11)2)6-5-7-14(12)19-3/h5-7,11H,4,8-10H2,1-3H3,(H,16,18)
Reactome pathway
0.0300n/an/an/an/an/an/an/an/a
Universit£ degli Studi di Urbino"Carlo Bo"
Curated by ChEMBL
Assay Description
Displacement of 2-[125I]-Iodomelatonin from human MT1 receptor transfected in CHO cell membranes after 120 mins
J Med Chem 58: 7512-25 (2015)
BindingDB Entry DOI: 10.7270/Q20R9R6D
Melatonin receptor
(Homo sapiens (Human))
BDBM50117886
(CHEMBL3612603)
Show SMILES CCC(=O)NCC1CCc2c(OC)cccc2N1C
Show InChI InChI=1S/C15H22N2O2/c1-4-15(18)16-10-11-8-9-12-13(17(11)2)6-5-7-14(12)19-3/h5-7,11H,4,8-10H2,1-3H3,(H,16,18)
Reactome pathway
n/an/an/an/a 1.70n/an/an/an/a
Universit£ degli Studi di Urbino"Carlo Bo"
Curated by ChEMBL
Assay Description
Intrinsic activity at human MT1 receptor transfected in CHO cell membranes after 1 hr by [35S]GTPgammaS binding assay
J Med Chem 58: 7512-25 (2015)
BindingDB Entry DOI: 10.7270/Q20R9R6D