BDBM50117970 (6,7-Diethoxy-quinazolin-4-yl)-(3-thiazol-4-yl-phenyl)-amine::CHEMBL127223
SMILES: CCOc1cc2ncnc(Nc3cccc(c3)-c3cscn3)c2cc1OCC
InChI Key: InChIKey=HLIBFQDRDMBHNC-UHFFFAOYSA-N
Data: 1 IC50
Activity Spreadsheet -- Enzyme Inhibition Constant Data from BindingDB
Found 1 hit for monomerid = 50117970
Trg + Lig
Ki
nM
ΔG°
kcal/mole
IC50
nM
Kd
nM
EC50/IC50
nM
koff
s-1
kon
M-1s-1
pHTemp
°C
Epidermal growth factor receptor
(Homo sapiens (Human))
BDBM50117970
((6,7-Diethoxy-quinazolin-4-yl)-(3-thiazol-4-yl-phe...)
Show SMILES CCOc1cc2ncnc(Nc3cccc(c3)-c3cscn3)c2cc1OCC
Show InChI InChI=1S/C21H20N4O2S/c1-3-26-19-9-16-17(10-20(19)27-4-2)22-12-23-21(16)25-15-7-5-6-14(8-15)18-11-28-13-24-18/h5-13H,3-4H2,1-2H3,(H,22,23,25)
n/an/a 18n/an/an/an/an/an/a
Pfizer Central Research
Curated by ChEMBL
Assay Description
Inhibition of (EGFR) epidermal growth factor receptor tyrosine kinase
J Med Chem 45: 3865-77 (2002)
BindingDB Entry DOI: 10.7270/Q2PN94Z0