BDBM50118330 1-(5-Fluoro-benzo[b]thiophen-3-yl)-3-[4-(1H-indol-4-yl)-piperazin-1-yl]-propan-1-ol;::CHEMBL135623
SMILES: OC(CCN1CCN(CC1)c1cccc2[nH]ccc12)c1csc2ccc(F)cc12
InChI Key: InChIKey=GWCXMTRMKIIFDL-UHFFFAOYSA-N
Data: 2 KI  1 IC50
Activity Spreadsheet -- Enzyme Inhibition Constant Data from BindingDB
Found 3 hits for monomerid = 50118330
Trg + Lig
Ki
nM
ΔG°
kcal/mole
IC50
nM
Kd
nM
EC50/IC50
nM
koff
s-1
kon
M-1s-1
pHTemp
°C
5-hydroxytryptamine receptor 1A
(Rattus norvegicus (rat))
BDBM50118330
(1-(5-Fluoro-benzo[b]thiophen-3-yl)-3-[4-(1H-indol-...)
Show SMILES OC(CCN1CCN(CC1)c1cccc2[nH]ccc12)c1csc2ccc(F)cc12
Show InChI InChI=1S/C23H24FN3OS/c24-16-4-5-23-18(14-16)19(15-29-23)22(28)7-9-26-10-12-27(13-11-26)21-3-1-2-20-17(21)6-8-25-20/h1-6,8,14-15,22,25,28H,7,9-13H2
5.90n/an/an/an/an/an/an/an/a
Universidad de Navarra
Curated by ChEMBL
Assay Description
Binding affinity towards 5-hydroxytryptamine 1A receptor in rat frontal cortex homogenates
J Med Chem 45: 4128-39 (2002)
BindingDB Entry DOI: 10.7270/Q2X63M87
Sodium-dependent serotonin transporter
(Rattus norvegicus (rat))
BDBM50118330
(1-(5-Fluoro-benzo[b]thiophen-3-yl)-3-[4-(1H-indol-...)
Show SMILES OC(CCN1CCN(CC1)c1cccc2[nH]ccc12)c1csc2ccc(F)cc12
Show InChI InChI=1S/C23H24FN3OS/c24-16-4-5-23-18(14-16)19(15-29-23)22(28)7-9-26-10-12-27(13-11-26)21-3-1-2-20-17(21)6-8-25-20/h1-6,8,14-15,22,25,28H,7,9-13H2
7.30n/an/an/an/an/an/an/an/a
Universidad de Navarra
Curated by ChEMBL
Assay Description
Binding affinity towards Serotonin transporter (5-HTT) in rat frontal cortex homogenates
J Med Chem 45: 4128-39 (2002)
BindingDB Entry DOI: 10.7270/Q2X63M87
5-hydroxytryptamine receptor 1A
(Rattus norvegicus (rat))
BDBM50118330
(1-(5-Fluoro-benzo[b]thiophen-3-yl)-3-[4-(1H-indol-...)
Show SMILES OC(CCN1CCN(CC1)c1cccc2[nH]ccc12)c1csc2ccc(F)cc12
Show InChI InChI=1S/C23H24FN3OS/c24-16-4-5-23-18(14-16)19(15-29-23)22(28)7-9-26-10-12-27(13-11-26)21-3-1-2-20-17(21)6-8-25-20/h1-6,8,14-15,22,25,28H,7,9-13H2
n/an/a 16.1n/an/an/an/an/an/a
Universidad de Navarra
Curated by ChEMBL
Assay Description
Inhibition of (+)-8-OH-DPAT stimulated [35S]-GTP-gammaS, binding to 5-hydroxytryptamine 1A receptor in hippocampal membranes
J Med Chem 45: 4128-39 (2002)
BindingDB Entry DOI: 10.7270/Q2X63M87