BDBM50118484 CHEMBL3617060
SMILES: CN1CC[C@]2(CC[C@H](N2)c2cc(ccn2)-c2cccc(OC(F)(F)F)c2)C1=O
InChI Key: InChIKey=PQMSYXWLWIWNLV-QFBILLFUSA-N
Data: 1 IC50
Activity Spreadsheet -- Enzyme Inhibition Constant Data from BindingDB
Found 1 hit for monomerid = 50118484
Trg + Lig
Ki
nM
ΔG°
kcal/mole
IC50
nM
Kd
nM
EC50/IC50
nM
koff
s-1
kon
M-1s-1
pHTemp
°C
Sodium channel protein type 9 subunit alpha
(Homo sapiens (Human))
BDBM50118484
(CHEMBL3617060)
Show SMILES CN1CC[C@]2(CC[C@H](N2)c2cc(ccn2)-c2cccc(OC(F)(F)F)c2)C1=O |r|
Show InChI InChI=1S/C20H20F3N3O2/c1-26-10-8-19(18(26)27)7-5-16(25-19)17-12-14(6-9-24-17)13-3-2-4-15(11-13)28-20(21,22)23/h2-4,6,9,11-12,16,25H,5,7-8,10H2,1H3/t16-,19+/m0/s1
n/an/a 251n/an/an/an/an/an/a
Merck Research Laboratories
Curated by ChEMBL
Assay Description
Inhibition of human NaV1.7 channel expressed in HEK293 cells treated for 120 secs by QPatch assay
J Med Chem 58: 7093-118 (2015)
BindingDB Entry DOI: 10.7270/Q2XS5X6P