BDBM50118495 5-Methyl-1-pentadec-2-enyl-1H-pyrimidine-2,4-dione::CHEMBL135496
SMILES: CCCCCCCCCCCC\C=C/Cn1cc(C)c(=O)[nH]c1=O
InChI Key: InChIKey=JXDFNHWKTUPARF-PFONDFGASA-N
Data: 1 IC50
Activity Spreadsheet -- Enzyme Inhibition Constant Data from BindingDB
Found 1 hit for monomerid = 50118495
Trg + Lig
Ki
nM
ΔG°
kcal/mole
IC50
nM
Kd
nM
EC50/IC50
nM
koff
s-1
kon
M-1s-1
pHTemp
°C
Thymidine kinase, cytosolic
(Homo sapiens (Human))
BDBM50118495
(5-Methyl-1-pentadec-2-enyl-1H-pyrimidine-2,4-dione...)
Show SMILES CCCCCCCCCCCC\C=C/Cn1cc(C)c(=O)[nH]c1=O
Show InChI InChI=1S/C20H34N2O2/c1-3-4-5-6-7-8-9-10-11-12-13-14-15-16-22-17-18(2)19(23)21-20(22)24/h14-15,17H,3-13,16H2,1-2H3,(H,21,23,24)/b15-14-
NCI pathway
Reactome pathway
n/an/a 1.90E+4n/an/an/an/an/an/a
Instituto de Qu£mica M£dica (CSIC)
Curated by ChEMBL
Assay Description
Inhibitory effect against phosphorylation of [methyl-3H]dThd by Thymidine Kinase 2 (TK-2)
J Med Chem 45: 4254-63 (2002)
BindingDB Entry DOI: 10.7270/Q2GQ6ZGB