BDBM50118706 (S)-1-(4-{2,6-Dimethyl-4-[2-(4-methyl-piperazin-1-yl)-pyrimidin-4-yl]-piperazin-1-yl}-pyrimidin-2-yl)-ethanol::1-(4-{2,6-Dimethyl-4-[2-(4-methyl-piperazin-1-yl)-pyrimidin-4-yl]-piperazin-1-yl}-pyrimidin-2-yl)-ethanol::CHEMBL136900
SMILES: C[C@@H](O)c1nccc(n1)N1[C@@H](C)CN(C[C@H]1C)c1ccnc(n1)N1CCN(C)CC1
InChI Key: InChIKey=HMCOWIZZDSWTIH-IXDOHACOSA-N
Data: 2 IC50
Activity Spreadsheet -- Enzyme Inhibition Constant Data from BindingDB
Found 2 hits for monomerid = 50118706
Trg + Lig
Ki
nM
ΔG°
kcal/mole
IC50
nM
Kd
nM
EC50/IC50
nM
koff
s-1
kon
M-1s-1
pHTemp
°C
Sorbitol dehydrogenase
(Rattus norvegicus)
BDBM50118706
((S)-1-(4-{2,6-Dimethyl-4-[2-(4-methyl-piperazin-1-...)
Show SMILES C[C@@H](O)c1nccc(n1)N1[C@@H](C)CN(C[C@H]1C)c1ccnc(n1)N1CCN(C)CC1
Show InChI InChI=1S/C21H32N8O/c1-15-13-28(14-16(2)29(15)19-6-7-22-20(24-19)17(3)30)18-5-8-23-21(25-18)27-11-9-26(4)10-12-27/h5-8,15-17,30H,9-14H2,1-4H3/t15-,16+,17-/m1/s1
n/an/a 6n/an/an/an/an/an/a
Pfizer Global Research and Development
Curated by ChEMBL
Assay Description
Concentration required for 50% in vitro activity against rat SDH (sorbitol dehydrogenase)
J Med Chem 45: 4398-401 (2002)
BindingDB Entry DOI: 10.7270/Q2V69HZM
Sorbitol dehydrogenase
(Homo sapiens (Human))
BDBM50118706
((S)-1-(4-{2,6-Dimethyl-4-[2-(4-methyl-piperazin-1-...)
Show SMILES C[C@@H](O)c1nccc(n1)N1[C@@H](C)CN(C[C@H]1C)c1ccnc(n1)N1CCN(C)CC1
Show InChI InChI=1S/C21H32N8O/c1-15-13-28(14-16(2)29(15)19-6-7-22-20(24-19)17(3)30)18-5-8-23-21(25-18)27-11-9-26(4)10-12-27/h5-8,15-17,30H,9-14H2,1-4H3/t15-,16+,17-/m1/s1
n/an/a 4n/an/an/an/an/an/a
Pfizer Global Research and Development
Curated by ChEMBL
Assay Description
Concentration required for 50% for in vitro activity against human SDH (sorbitol dehydrogenase)
J Med Chem 45: 4398-401 (2002)
BindingDB Entry DOI: 10.7270/Q2V69HZM