BDBM50118753 2-(Oxalyl-amino)-5,6-dihydro-4H-cyclopenta[b]thiophene-3-carboxylic acid::2-(carboxyformamido)-5,6-dihydro-4H-cyclopenta[b]thiophene-3-carboxylic acid::CHEMBL139489
SMILES: OC(=O)C(=O)Nc1sc2CCCc2c1C(O)=O
InChI Key: InChIKey=TXYXESJGTMAPGK-UHFFFAOYSA-N
Data: 5 KI
Activity Spreadsheet -- Enzyme Inhibition Constant Data from BindingDB
Found 5 hits for monomerid = 50118753
Trg + Lig
Ki
nM
ΔG°
kcal/mole
IC50
nM
Kd
nM
EC50/IC50
nM
koff
s-1
kon
M-1s-1
pHTemp
°C
Protein-tyrosine phosphatase 1B
(Homo sapiens (Human))
BDBM50118753
(2-(Oxalyl-amino)-5,6-dihydro-4H-cyclopenta[b]thiop...)
Show SMILES OC(=O)C(=O)Nc1sc2CCCc2c1C(O)=O
Show InChI InChI=1S/C10H9NO5S/c12-7(10(15)16)11-8-6(9(13)14)4-2-1-3-5(4)17-8/h1-3H2,(H,11,12)(H,13,14)(H,15,16)
NCI pathway
Reactome pathway
1.20E+4n/an/an/an/an/an/a5.5n/a
Novo Nordisk A/S
Curated by ChEMBL
Assay Description
Inhibitory effect against recombinant human protein-tyrosine phosphatase 1B (PTP1B), using p-nitrophenyl phosphate substrate at pH 5.5.
J Med Chem 45: 4443-59 (2002)
BindingDB Entry DOI: 10.7270/Q2QJ7GM5
Protein-tyrosine phosphatase 1B
(Homo sapiens (Human))
BDBM50118753
(2-(Oxalyl-amino)-5,6-dihydro-4H-cyclopenta[b]thiop...)
Show SMILES OC(=O)C(=O)Nc1sc2CCCc2c1C(O)=O
Show InChI InChI=1S/C10H9NO5S/c12-7(10(15)16)11-8-6(9(13)14)4-2-1-3-5(4)17-8/h1-3H2,(H,11,12)(H,13,14)(H,15,16)
NCI pathway
Reactome pathway
1.20E+4n/an/an/an/an/an/an/an/a
Tsinghua University
Curated by ChEMBL
Assay Description
Binding affinity to human recombinant PTP1B
Bioorg Med Chem Lett 20: 3329-37 (2010)
Article DOI: 10.1016/j.bmcl.2010.04.033
BindingDB Entry DOI: 10.7270/Q27D2WCC
Protein-tyrosine phosphatase alpha
(Homo sapiens (Human))
BDBM50118753
(2-(Oxalyl-amino)-5,6-dihydro-4H-cyclopenta[b]thiop...)
Show SMILES OC(=O)C(=O)Nc1sc2CCCc2c1C(O)=O
Show InChI InChI=1S/C10H9NO5S/c12-7(10(15)16)11-8-6(9(13)14)4-2-1-3-5(4)17-8/h1-3H2,(H,11,12)(H,13,14)(H,15,16)
3.40E+5n/an/an/an/an/an/a5.5n/a
Novo Nordisk A/S
Curated by ChEMBL
Assay Description
Inhibitory effect against human protein-tyrosine phosphatase alpha (PTPalpha), using p-nitrophenyl phosphate substrate at pH 5.5.
J Med Chem 45: 4443-59 (2002)
BindingDB Entry DOI: 10.7270/Q2QJ7GM5
Receptor-type tyrosine-protein phosphatase F (LAR)
(Homo sapiens (Human))
BDBM50118753
(2-(Oxalyl-amino)-5,6-dihydro-4H-cyclopenta[b]thiop...)
Show SMILES OC(=O)C(=O)Nc1sc2CCCc2c1C(O)=O
Show InChI InChI=1S/C10H9NO5S/c12-7(10(15)16)11-8-6(9(13)14)4-2-1-3-5(4)17-8/h1-3H2,(H,11,12)(H,13,14)(H,15,16)
9.00E+5n/an/an/an/an/an/a5.5n/a
Novo Nordisk A/S
Curated by ChEMBL
Assay Description
Inhibitory effect against protein-tyrosine phosphatase Lar, using p-nitrophenyl phosphate as substrate at pH 5.5.
J Med Chem 45: 4443-59 (2002)
BindingDB Entry DOI: 10.7270/Q2QJ7GM5
Protein-tyrosine phosphatase 1B
(Homo sapiens (Human))
BDBM50118753
(2-(Oxalyl-amino)-5,6-dihydro-4H-cyclopenta[b]thiop...)
Show SMILES OC(=O)C(=O)Nc1sc2CCCc2c1C(O)=O
Show InChI InChI=1S/C10H9NO5S/c12-7(10(15)16)11-8-6(9(13)14)4-2-1-3-5(4)17-8/h1-3H2,(H,11,12)(H,13,14)(H,15,16)
NCI pathway
Reactome pathway
8.34E+13n/an/an/an/an/an/an/an/a
Graduate University of Chinese Academy of Sciences
Curated by ChEMBL
Assay Description
Binding affinity to PTP1B
Bioorg Med Chem Lett 15: 5521-5 (2005)
Article DOI: 10.1016/j.bmcl.2005.08.078
BindingDB Entry DOI: 10.7270/Q2TF0139