BDBM50119097 (S)-3-(4-Allylcarbamoyloxy-phenyl)-2-(2-chloro-benzoylamino)-propionic acid::CHEMBL100164
SMILES: OC(=O)[C@H](Cc1ccc(OC(=O)NCC=C)cc1)NC(=O)c1ccccc1Cl
InChI Key: InChIKey=GDOCTXXUSWKFKD-KRWDZBQOSA-N
Data: 2 IC50
Activity Spreadsheet -- Enzyme Inhibition Constant Data from BindingDB
Found 2 hits for monomerid = 50119097
Trg + Lig
Ki
nM
ΔG°
kcal/mole
IC50
nM
Kd
nM
EC50/IC50
nM
koff
s-1
kon
M-1s-1
pHTemp
°C
Fibronectin receptor beta/Integrin alpha-4
(Homo sapiens (Human))
BDBM50119097
((S)-3-(4-Allylcarbamoyloxy-phenyl)-2-(2-chloro-ben...)
Show SMILES OC(=O)[C@H](Cc1ccc(OC(=O)NCC=C)cc1)NC(=O)c1ccccc1Cl
Show InChI InChI=1S/C20H19ClN2O5/c1-2-11-22-20(27)28-14-9-7-13(8-10-14)12-17(19(25)26)23-18(24)15-5-3-4-6-16(15)21/h2-10,17H,1,11-12H2,(H,22,27)(H,23,24)(H,25,26)/t17-/m0/s1
Reactome pathway
n/an/a 35n/an/an/an/an/an/a
Genentech
Curated by ChEMBL
Assay Description
Inhibitory activity against alpha4-beta1 integrin (vascular cell adhesion molecule) in ELISA assay
Bioorg Med Chem Lett 12: 2913-7 (2002)
BindingDB Entry DOI: 10.7270/Q2X34WT2
Integrin α4β7
(Homo sapiens (Human))
BDBM50119097
((S)-3-(4-Allylcarbamoyloxy-phenyl)-2-(2-chloro-ben...)
Show SMILES OC(=O)[C@H](Cc1ccc(OC(=O)NCC=C)cc1)NC(=O)c1ccccc1Cl
Show InChI InChI=1S/C20H19ClN2O5/c1-2-11-22-20(27)28-14-9-7-13(8-10-14)12-17(19(25)26)23-18(24)15-5-3-4-6-16(15)21/h2-10,17H,1,11-12H2,(H,22,27)(H,23,24)(H,25,26)/t17-/m0/s1
NCI pathway
Reactome pathway
n/an/a 56n/an/an/an/an/an/a
Genentech
Curated by ChEMBL
Assay Description
Inhibitory activity against alpha4-beta7/ MAdCAM integrin (mucosal addressin cell adhesion molecule) in ELISA assay
Bioorg Med Chem Lett 12: 2913-7 (2002)
BindingDB Entry DOI: 10.7270/Q2X34WT2