BDBM50119317 5-(4-{3-[1-((3S,4S)-1-Cyclohexylmethyl-4-phenyl-pyrrolidin-3-ylmethyl)-4-hydroxy-piperidin-4-yl]-propyl}-phenyl)-2-methyl-1H-tetrazol-2-ium::CHEMBL103790
SMILES: Cn1n[nH+]c(n1)-c1ccc(CCCC2(O)CCN(CC3CN(CC4CCCCC4)CC3c3ccccc3)CC2)cc1
InChI Key: InChIKey=VRWSWNLSRFRDDD-UHFFFAOYSA-O
Data: 1 IC50
Activity Spreadsheet -- Enzyme Inhibition Constant Data from BindingDB
Found 1 hit for monomerid = 50119317
Trg + Lig
Ki
nM
ΔG°
kcal/mole
IC50
nM
Kd
nM
EC50/IC50
nM
koff
s-1
kon
M-1s-1
pHTemp
°C
C-C chemokine receptor type 5
(Homo sapiens (Human))
BDBM50119317
(5-(4-{3-[1-((3S,4S)-1-Cyclohexylmethyl-4-phenyl-py...)
Show SMILES Cn1n[nH+]c(n1)-c1ccc(CCCC2(O)CCN(CC3CN(CC4CCCCC4)CC3c3ccccc3)CC2)cc1
Show InChI InChI=1S/C34H48N6O/c1-38-36-33(35-37-38)30-16-14-27(15-17-30)11-8-18-34(41)19-21-39(22-20-34)24-31-25-40(23-28-9-4-2-5-10-28)26-32(31)29-12-6-3-7-13-29/h3,6-7,12-17,28,31-32,41H,2,4-5,8-11,18-26H2,1H3/p+1
n/an/a 0.400n/an/an/an/an/an/a
Merck Research Laboratories
Curated by ChEMBL
Assay Description
Displacement of [125I]-labeled MIP-1alpha from the C-C chemokine receptor type 5 expressed on CHO cell membranes
Bioorg Med Chem Lett 12: 2997-3000 (2002)
BindingDB Entry DOI: 10.7270/Q2RB73ZB