null
SMILES: C(CCCCCC[n+]1ccc2ccccc2c1)CCCCC[n+]1ccc2ccccc2c1
InChI Key: InChIKey=ZZPJJAPKSCPCSZ-UHFFFAOYSA-N
Activity Spreadsheet -- Enzyme Inhibition Constant Data from BindingDB
Found 5 hits for monomerid = 50119805
Trg + Lig
Ki
nM
ΔG°
kcal/mole
IC50
nM
Kd
nM
EC50/IC50
nM
koff
s-1
kon
M-1s-1
pHTemp
°C
Neuronal acetylcholine receptor subunit alpha-7
(Rattus norvegicus (Rat))
BDBM50119805
(1,12-di(2-isoquinoliniumyl)dodecane; with dibromid...)
Show SMILES C(CCCCCC[n+]1ccc2ccccc2c1)CCCCC[n+]1ccc2ccccc2c1
Show InChI InChI=1S/C30H38N2/c1(3-5-7-13-21-31-23-19-27-15-9-11-17-29(27)25-31)2-4-6-8-14-22-32-24-20-28-16-10-12-18-30(28)26-32/h9-12,15-20,23-26H,1-8,13-14,21-22H2/q+2
Reactome pathway
2.21E+3n/an/an/an/an/an/an/an/a
University of Kentucky
Curated by ChEMBL
Assay Description
Binding affinity nicotinic acetylcholine receptor alpha-7 was evaluated by its ability to inhibit [3H]methyllycaconitine ([3H]-MLA) binding to rat br...
Bioorg Med Chem Lett 12: 3067-71 (2002)
BindingDB Entry DOI: 10.7270/Q2Q81DNR
Neuronal acetylcholine receptor subunit alpha-4/beta-2
(Rattus norvegicus (Rat))
BDBM50119805
(1,12-di(2-isoquinoliniumyl)dodecane; with dibromid...)
Show SMILES C(CCCCCC[n+]1ccc2ccccc2c1)CCCCC[n+]1ccc2ccccc2c1
Show InChI InChI=1S/C30H38N2/c1(3-5-7-13-21-31-23-19-27-15-9-11-17-29(27)25-31)2-4-6-8-14-22-32-24-20-28-16-10-12-18-30(28)26-32/h9-12,15-20,23-26H,1-8,13-14,21-22H2/q+2
6.10E+3n/an/an/an/an/an/an/an/a
University of Kentucky
Curated by ChEMBL
Assay Description
Binding affinity for nicotinic acetylcholine receptor alpha4-beta2 was evaluated by its ability to inhibit [3H]NIC binding to rat brain membranes
Bioorg Med Chem Lett 12: 3067-71 (2002)
BindingDB Entry DOI: 10.7270/Q2Q81DNR
Neuronal acetylcholine receptor subunit alpha-6
(Rattus norvegicus)
BDBM50119805
(1,12-di(2-isoquinoliniumyl)dodecane; with dibromid...)
Show SMILES C(CCCCCC[n+]1ccc2ccccc2c1)CCCCC[n+]1ccc2ccccc2c1
Show InChI InChI=1S/C30H38N2/c1(3-5-7-13-21-31-23-19-27-15-9-11-17-29(27)25-31)2-4-6-8-14-22-32-24-20-28-16-10-12-18-30(28)26-32/h9-12,15-20,23-26H,1-8,13-14,21-22H2/q+2
n/an/a 40n/an/an/an/an/an/a
University of Kentucky
Curated by ChEMBL
Assay Description
Antagonist activity at alpha6 nAChR in rat striatum assessed as inhibition of nicotine-induced [3H]dopamine release
Bioorg Med Chem Lett 21: 88-91 (2010)
Article DOI: 10.1016/j.bmcl.2010.11.070
BindingDB Entry DOI: 10.7270/Q2VT1SDX
Acetylcholinesterase
(Homo sapiens (Human))
BDBM50119805
(1,12-di(2-isoquinoliniumyl)dodecane; with dibromid...)
Show SMILES C(CCCCCC[n+]1ccc2ccccc2c1)CCCCC[n+]1ccc2ccccc2c1
Show InChI InChI=1S/C30H38N2/c1(3-5-7-13-21-31-23-19-27-15-9-11-17-29(27)25-31)2-4-6-8-14-22-32-24-20-28-16-10-12-18-30(28)26-32/h9-12,15-20,23-26H,1-8,13-14,21-22H2/q+2
NCI pathway
Reactome pathway
n/an/a 1.37E+5n/an/an/an/an/an/a
University of Defence
Curated by ChEMBL
Assay Description
Inhibition of human recombinant AChE by Lineweaver-Burk plot analysis
Eur J Med Chem 46: 811-8 (2011)
Article DOI: 10.1016/j.ejmech.2010.12.011
BindingDB Entry DOI: 10.7270/Q2PR7W8D
Cholinesterase
(Homo sapiens (Human))
BDBM50119805
(1,12-di(2-isoquinoliniumyl)dodecane; with dibromid...)
Show SMILES C(CCCCCC[n+]1ccc2ccccc2c1)CCCCC[n+]1ccc2ccccc2c1
Show InChI InChI=1S/C30H38N2/c1(3-5-7-13-21-31-23-19-27-15-9-11-17-29(27)25-31)2-4-6-8-14-22-32-24-20-28-16-10-12-18-30(28)26-32/h9-12,15-20,23-26H,1-8,13-14,21-22H2/q+2
Reactome pathway
n/an/a 100n/an/an/an/an/an/a
University of Defence
Curated by ChEMBL
Assay Description
Inhibition of human plasmatic BChE by Lineweaver-Burk plot analysis
Eur J Med Chem 46: 811-8 (2011)
Article DOI: 10.1016/j.ejmech.2010.12.011
BindingDB Entry DOI: 10.7270/Q2PR7W8D