BDBM50119876 CHEMBL3616518
SMILES: CCn1c2ncn(CCc3ccccc3)c2c(=O)n(O)c1=O
InChI Key: InChIKey=AVBQYYJZMJKIAP-UHFFFAOYSA-N
Data: 1 IC50
Activity Spreadsheet -- Enzyme Inhibition Constant Data from BindingDB
Found 1 hit for monomerid = 50119876
Trg + Lig
Ki
nM
ΔG°
kcal/mole
IC50
nM
Kd
nM
EC50/IC50
nM
koff
s-1
kon
M-1s-1
pHTemp
°C
CCR4-NOT transcription complex subunit 7
(Homo sapiens (Human))
BDBM50119876
(CHEMBL3616518)
Show SMILES CCn1c2ncn(CCc3ccccc3)c2c(=O)n(O)c1=O
Show InChI InChI=1S/C15H16N4O3/c1-2-18-13-12(14(20)19(22)15(18)21)17(10-16-13)9-8-11-6-4-3-5-7-11/h3-7,10,22H,2,8-9H2,1H3
n/an/a 1.22E+4n/an/an/an/an/an/a
University of Nottingham
Curated by ChEMBL
Assay Description
Inhibition of human poly(A)-selective ribonuclease Caf1 by fluorescence-based assay
Bioorg Med Chem Lett 25: 4219-24 (2015)
BindingDB Entry DOI: 10.7270/Q2BV7JFF