BDBM50120104 4-(2-Chloro-6-methyl-phenylamino)-imidazo[1,5-a]quinoxaline-7,8-diol::4-(2-chloro-6-methylphenylamino)imidazo[1,5-a]quinoxaline-7,8-diol::CHEMBL110220
SMILES: Cc1cccc(Cl)c1Nc1nc2cc(O)c(O)cc2n2cncc12
InChI Key: InChIKey=UOGKOQVJFMUHCN-UHFFFAOYSA-N
Data: 2 IC50
Activity Spreadsheet -- Enzyme Inhibition Constant Data from BindingDB
Found 2 hits for monomerid = 50120104
Trg + Lig
Ki
nM
ΔG°
kcal/mole
IC50
nM
Kd
nM
EC50/IC50
nM
koff
s-1
kon
M-1s-1
pHTemp
°C
Tyrosine-protein kinase Lck
(Homo sapiens (Human))
BDBM50120104
(4-(2-Chloro-6-methyl-phenylamino)-imidazo[1,5-a]qu...)
Show SMILES Cc1cccc(Cl)c1Nc1nc2cc(O)c(O)cc2n2cncc12
Show InChI InChI=1S/C17H13ClN4O2/c1-9-3-2-4-10(18)16(9)21-17-13-7-19-8-22(13)12-6-15(24)14(23)5-11(12)20-17/h2-8,23-24H,1H3,(H,20,21)
n/an/a 4n/an/an/an/an/an/a
University of Zurich
Curated by ChEMBL
Assay Description
Inhibition of Lck
J Med Chem 51: 1179-88 (2008)
Article DOI: 10.1021/jm070654j
BindingDB Entry DOI: 10.7270/Q29Z95RD
Tyrosine-protein kinase Lck
(Homo sapiens (Human))
BDBM50120104
(4-(2-Chloro-6-methyl-phenylamino)-imidazo[1,5-a]qu...)
Show SMILES Cc1cccc(Cl)c1Nc1nc2cc(O)c(O)cc2n2cncc12
Show InChI InChI=1S/C17H13ClN4O2/c1-9-3-2-4-10(18)16(9)21-17-13-7-19-8-22(13)12-6-15(24)14(23)5-11(12)20-17/h2-8,23-24H,1H3,(H,20,21)
n/an/a 4n/an/an/an/an/an/a
Bristol Myers Squibb Pharmaceutical Research Institute
Curated by ChEMBL
Assay Description
50% inhibition of the phosphorylation of an exogenous substrate by human Lck enzyme.
Bioorg Med Chem Lett 12: 3153-6 (2002)
BindingDB Entry DOI: 10.7270/Q2NC60JR