null
SMILES: CCCC(c1ccc(cc1)C(=O)NCCC(O)=O)n1nc(-c2cc(ccc2OC)C(F)(F)F)c2ccc(cc12)-c1ccc(C)cc1
InChI Key: InChIKey=ZTWOYZCDZLBDLH-UHFFFAOYSA-N
Activity Spreadsheet -- Enzyme Inhibition Constant Data from BindingDB
Found 2 hits for monomerid = 50120281
Trg + Lig
Ki
nM
ΔG°
kcal/mole
IC50
nM
Kd
nM
EC50/IC50
nM
koff
s-1
kon
M-1s-1
pHTemp
°C
Glucagon receptor
(Homo sapiens (Human))
BDBM50120281
(CHEMBL3616584)
Show SMILES CCCC(c1ccc(cc1)C(=O)NCCC(O)=O)n1nc(-c2cc(ccc2OC)C(F)(F)F)c2ccc(cc12)-c1ccc(C)cc1
Show InChI InChI=1S/C36H34F3N3O4/c1-4-5-30(24-10-12-25(13-11-24)35(45)40-19-18-33(43)44)42-31-20-26(23-8-6-22(2)7-9-23)14-16-28(31)34(41-42)29-21-27(36(37,38)39)15-17-32(29)46-3/h6-17,20-21,30H,4-5,18-19H2,1-3H3,(H,40,45)(H,43,44)
n/an/a 2n/an/an/an/an/an/a
Merck Research Laboratories
Curated by ChEMBL
Assay Description
Displacement of [125I]glucagon from human glucagon receptor expressed in CHO cell membranes
Bioorg Med Chem Lett 25: 4143-7 (2015)
BindingDB Entry DOI: 10.7270/Q23F4RGX
Glucagon receptor
(Homo sapiens (Human))
BDBM50120281
(CHEMBL3616584)
Show SMILES CCCC(c1ccc(cc1)C(=O)NCCC(O)=O)n1nc(-c2cc(ccc2OC)C(F)(F)F)c2ccc(cc12)-c1ccc(C)cc1
Show InChI InChI=1S/C36H34F3N3O4/c1-4-5-30(24-10-12-25(13-11-24)35(45)40-19-18-33(43)44)42-31-20-26(23-8-6-22(2)7-9-23)14-16-28(31)34(41-42)29-21-27(36(37,38)39)15-17-32(29)46-3/h6-17,20-21,30H,4-5,18-19H2,1-3H3,(H,40,45)(H,43,44)
n/an/a 5n/an/an/an/an/an/a
Merck Research Laboratories
Curated by ChEMBL
Assay Description
Antagonist activity against human glucagon receptor expressed in CHO cells assessed as reduction in glucagon-induced cAMP production
Bioorg Med Chem Lett 25: 4143-7 (2015)
BindingDB Entry DOI: 10.7270/Q23F4RGX