BDBM50120339 CHEMBL3616687
SMILES: CCCCC(c1ccc(cc1)C(=O)NCCC(O)=O)n1nc(-c2cc(ccc2OC)C(F)(F)F)c2ccc(cc12)-c1ccc(OC)cc1
InChI Key: InChIKey=XCTJTYGURHKFME-UHFFFAOYSA-N
Data: 3 IC50
Activity Spreadsheet -- Enzyme Inhibition Constant Data from BindingDB
Found 3 hits for monomerid = 50120339
Trg + Lig
Ki
nM
ΔG°
kcal/mole
IC50
nM
Kd
nM
EC50/IC50
nM
koff
s-1
kon
M-1s-1
pHTemp
°C
Glucagon receptor
(Homo sapiens (Human))
BDBM50120339
(CHEMBL3616687)
Show SMILES CCCCC(c1ccc(cc1)C(=O)NCCC(O)=O)n1nc(-c2cc(ccc2OC)C(F)(F)F)c2ccc(cc12)-c1ccc(OC)cc1
Show InChI InChI=1S/C37H36F3N3O5/c1-4-5-6-31(24-7-9-25(10-8-24)36(46)41-20-19-34(44)45)43-32-21-26(23-11-15-28(47-2)16-12-23)13-17-29(32)35(42-43)30-22-27(37(38,39)40)14-18-33(30)48-3/h7-18,21-22,31H,4-6,19-20H2,1-3H3,(H,41,46)(H,44,45)
n/an/a 14n/an/an/an/an/an/a
Merck Research Laboratories
Curated by ChEMBL
Assay Description
Antagonist activity against human glucagon receptor expressed in CHO cells assessed as reduction in glucagon-induced cAMP production
Bioorg Med Chem Lett 25: 4143-7 (2015)
BindingDB Entry DOI: 10.7270/Q23F4RGX
Glucagon receptor
(Homo sapiens (Human))
BDBM50120339
(CHEMBL3616687)
Show SMILES CCCCC(c1ccc(cc1)C(=O)NCCC(O)=O)n1nc(-c2cc(ccc2OC)C(F)(F)F)c2ccc(cc12)-c1ccc(OC)cc1
Show InChI InChI=1S/C37H36F3N3O5/c1-4-5-6-31(24-7-9-25(10-8-24)36(46)41-20-19-34(44)45)43-32-21-26(23-11-15-28(47-2)16-12-23)13-17-29(32)35(42-43)30-22-27(37(38,39)40)14-18-33(30)48-3/h7-18,21-22,31H,4-6,19-20H2,1-3H3,(H,41,46)(H,44,45)
n/an/a 1.90n/an/an/an/an/an/a
Merck Research Laboratories
Curated by ChEMBL
Assay Description
Displacement of [125I]glucagon from human glucagon receptor expressed in CHO cell membranes
Bioorg Med Chem Lett 25: 4143-7 (2015)
BindingDB Entry DOI: 10.7270/Q23F4RGX
Gastric inhibitory polypeptide receptor
(Homo sapiens (Human))
BDBM50120339
(CHEMBL3616687)
Show SMILES CCCCC(c1ccc(cc1)C(=O)NCCC(O)=O)n1nc(-c2cc(ccc2OC)C(F)(F)F)c2ccc(cc12)-c1ccc(OC)cc1
Show InChI InChI=1S/C37H36F3N3O5/c1-4-5-6-31(24-7-9-25(10-8-24)36(46)41-20-19-34(44)45)43-32-21-26(23-11-15-28(47-2)16-12-23)13-17-29(32)35(42-43)30-22-27(37(38,39)40)14-18-33(30)48-3/h7-18,21-22,31H,4-6,19-20H2,1-3H3,(H,41,46)(H,44,45)
Reactome pathway
n/an/a 1.10E+3n/an/an/an/an/an/a
Merck Research Laboratories
Curated by ChEMBL
Assay Description
Antagonist activity against human glucose dependent insulinotropic peptide receptor by cAMP accumulation assay
Bioorg Med Chem Lett 25: 4143-7 (2015)
BindingDB Entry DOI: 10.7270/Q23F4RGX