BDBM50120594 CHEMBL3618300
SMILES: CCC(=O)C1=C(C)N=C2Sc3ccccc3N2C1c1ccc(O)c(OC)c1
InChI Key: InChIKey=WUHWTIYAPXHAFF-UHFFFAOYSA-N
Data: 2 IC50
Activity Spreadsheet -- Enzyme Inhibition Constant Data from BindingDB
Found 2 hits for monomerid = 50120594
Trg + Lig
Ki
nM
ΔG°
kcal/mole
IC50
nM
Kd
nM
EC50/IC50
nM
koff
s-1
kon
M-1s-1
pHTemp
°C
Myosin light chain kinase, smooth muscle
(Homo sapiens (Human))
BDBM50120594
(CHEMBL3618300)
Show SMILES CCC(=O)C1=C(C)N=C2Sc3ccccc3N2C1c1ccc(O)c(OC)c1 |c:4,t:7|
Show InChI InChI=1S/C21H20N2O3S/c1-4-15(24)19-12(2)22-21-23(14-7-5-6-8-18(14)27-21)20(19)13-9-10-16(25)17(11-13)26-3/h5-11,20,25H,4H2,1-3H3
n/an/a 3.67E+10n/an/an/an/an/an/a
Rashtrasant Tukadoji Maharaj Nagpur University
Curated by ChEMBL
Assay Description
Inhibition of MLCK (unknown origin) incubated for 15 mins using [gamma-32P]-ATP by scintillation counting method
Bioorg Med Chem 23: 6689-713 (2015)
BindingDB Entry DOI: 10.7270/Q2P55Q95
Myosin light chain kinase, smooth muscle
(Homo sapiens (Human))
BDBM50120594
(CHEMBL3618300)
Show SMILES CCC(=O)C1=C(C)N=C2Sc3ccccc3N2C1c1ccc(O)c(OC)c1 |c:4,t:7|
Show InChI InChI=1S/C21H20N2O3S/c1-4-15(24)19-12(2)22-21-23(14-7-5-6-8-18(14)27-21)20(19)13-9-10-16(25)17(11-13)26-3/h5-11,20,25H,4H2,1-3H3
n/an/a 3.67E+3n/an/an/an/an/an/a
Rashtrasant Tukadoji Maharaj Nagpur University
Curated by ChEMBL
Assay Description
Inhibition of MLCK (unknown origin) incubated for 15 mins using [gamma-32P]-ATP by scintillation counting method
Bioorg Med Chem 23: 6689-713 (2015)
BindingDB Entry DOI: 10.7270/Q2P55Q95