BDBM50120692 2-{3-[4-(3,5-Dimethyl-benzyloxy)-phenyl]-3-methyl-2-oxo-pyrrolidin-1-yl}-N-hydroxy-propionamide::CHEMBL144548
SMILES: C[C@@H](N1CC[C@](C)(C1=O)c1ccc(OCc2cc(C)cc(C)c2)cc1)C(=O)NO
InChI Key: InChIKey=AHGKFZKBVGBMPT-HXOBKFHXSA-N
Data: 3 KI  1 IC50
Activity Spreadsheet -- Enzyme Inhibition Constant Data from BindingDB
Found 4 hits for monomerid = 50120692
Trg + Lig
Ki
nM
ΔG°
kcal/mole
IC50
nM
Kd
nM
EC50/IC50
nM
koff
s-1
kon
M-1s-1
pHTemp
°C
Matrix metalloproteinase-9
(Homo sapiens (Human))
BDBM50120692
(2-{3-[4-(3,5-Dimethyl-benzyloxy)-phenyl]-3-methyl-...)
Show SMILES C[C@@H](N1CC[C@](C)(C1=O)c1ccc(OCc2cc(C)cc(C)c2)cc1)C(=O)NO
Show InChI InChI=1S/C23H28N2O4/c1-15-11-16(2)13-18(12-15)14-29-20-7-5-19(6-8-20)23(4)9-10-25(22(23)27)17(3)21(26)24-28/h5-8,11-13,17,28H,9-10,14H2,1-4H3,(H,24,26)/t17-,23+/m1/s1
Reactome pathway
1.63E+3n/an/an/an/an/an/an/an/a
Bristol-Myers Squibb Company
Curated by ChEMBL
Assay Description
Affinity towards Matrix metalloprotease-9 (MMP-9)
J Med Chem 45: 4954-7 (2002)
BindingDB Entry DOI: 10.7270/Q2XP7497
Interstitial collagenase
(Homo sapiens (Human))
BDBM50120692
(2-{3-[4-(3,5-Dimethyl-benzyloxy)-phenyl]-3-methyl-...)
Show SMILES C[C@@H](N1CC[C@](C)(C1=O)c1ccc(OCc2cc(C)cc(C)c2)cc1)C(=O)NO
Show InChI InChI=1S/C23H28N2O4/c1-15-11-16(2)13-18(12-15)14-29-20-7-5-19(6-8-20)23(4)9-10-25(22(23)27)17(3)21(26)24-28/h5-8,11-13,17,28H,9-10,14H2,1-4H3,(H,24,26)/t17-,23+/m1/s1
Reactome pathway
4.75E+3n/an/an/an/an/an/an/an/a
Bristol-Myers Squibb Company
Curated by ChEMBL
Assay Description
Affinity towards Matrix metalloprotease-1 (MMP-1)
J Med Chem 45: 4954-7 (2002)
BindingDB Entry DOI: 10.7270/Q2XP7497
72 kDa type IV collagenase
(Homo sapiens (Human))
BDBM50120692
(2-{3-[4-(3,5-Dimethyl-benzyloxy)-phenyl]-3-methyl-...)
Show SMILES C[C@@H](N1CC[C@](C)(C1=O)c1ccc(OCc2cc(C)cc(C)c2)cc1)C(=O)NO
Show InChI InChI=1S/C23H28N2O4/c1-15-11-16(2)13-18(12-15)14-29-20-7-5-19(6-8-20)23(4)9-10-25(22(23)27)17(3)21(26)24-28/h5-8,11-13,17,28H,9-10,14H2,1-4H3,(H,24,26)/t17-,23+/m1/s1
Reactome pathway
5.81E+3n/an/an/an/an/an/an/an/a
Bristol-Myers Squibb Company
Curated by ChEMBL
Assay Description
Affinity for Matrix metalloprotease-2 (MMP-2)
J Med Chem 45: 4954-7 (2002)
BindingDB Entry DOI: 10.7270/Q2XP7497
Disintegrin and metalloproteinase domain-containing protein 17
(Sus scrofa (pig))
BDBM50120692
(2-{3-[4-(3,5-Dimethyl-benzyloxy)-phenyl]-3-methyl-...)
Show SMILES C[C@@H](N1CC[C@](C)(C1=O)c1ccc(OCc2cc(C)cc(C)c2)cc1)C(=O)NO
Show InChI InChI=1S/C23H28N2O4/c1-15-11-16(2)13-18(12-15)14-29-20-7-5-19(6-8-20)23(4)9-10-25(22(23)27)17(3)21(26)24-28/h5-8,11-13,17,28H,9-10,14H2,1-4H3,(H,24,26)/t17-,23+/m1/s1
n/an/a 4n/an/an/an/an/an/a
Bristol-Myers Squibb Company
Curated by ChEMBL
Assay Description
Affinity for Tumor necrosis factor alpha converting enzyme (TACE)
J Med Chem 45: 4954-7 (2002)
BindingDB Entry DOI: 10.7270/Q2XP7497