BDBM50121250 CHEMBL415584::F-G-G-F-T-G-A-R-K-S-Aib-R-K-L-A-N-Q-COOH
SMILES: CC[C@H](NC(=O)[C@H](CO)NC(=O)[C@H](CCCCN)NC(=O)[C@H](CCCNC(N)=N)NC(=O)[C@H](C)NC(=O)CNC(=O)[C@@H](NC(=O)[C@H](Cc1ccccc1)NC(=O)CNC(=O)CNC(=O)[C@@H](N)Cc1ccccc1)[C@@H](C)O)C(=O)N[C@@H](CCCNC(N)=N)C(=O)N[C@@H](CCCCN)C(=O)N[C@@H](CC(C)C)C(=O)N[C@@H](C)C(=O)N[C@@H](CC(N)=O)C(=O)N[C@@H](CCC(N)=O)C(O)=O
InChI Key: InChIKey=FBSIFFHLVXSJIC-KMOVSZGYSA-N
Data: 1 KI  1 EC50
Activity Spreadsheet -- Enzyme Inhibition Constant Data from BindingDB
Found 2 hits for monomerid = 50121250
Trg + Lig
Ki
nM
ΔG°
kcal/mole
IC50
nM
Kd
nM
EC50/IC50
nM
koff
s-1
kon
M-1s-1
pHTemp
°C
Nociceptin receptor
(Homo sapiens (Human))
BDBM50121250
(CHEMBL415584 | F-G-G-F-T-G-A-R-K-S-Aib-R-K-L-A-N-Q...)
Show SMILES CC[C@H](NC(=O)[C@H](CO)NC(=O)[C@H](CCCCN)NC(=O)[C@H](CCCNC(N)=N)NC(=O)[C@H](C)NC(=O)CNC(=O)[C@@H](NC(=O)[C@H](Cc1ccccc1)NC(=O)CNC(=O)CNC(=O)[C@@H](N)Cc1ccccc1)[C@@H](C)O)C(=O)N[C@@H](CCCNC(N)=N)C(=O)N[C@@H](CCCCN)C(=O)N[C@@H](CC(C)C)C(=O)N[C@@H](C)C(=O)N[C@@H](CC(N)=O)C(=O)N[C@@H](CCC(N)=O)C(O)=O
Show InChI InChI=1S/C80H131N27O22/c1-7-49(68(118)100-53(27-19-33-91-80(88)89)70(120)101-50(24-14-16-30-81)71(121)105-55(34-42(2)3)73(123)96-44(5)66(116)104-57(37-60(85)111)74(124)103-54(78(128)129)28-29-59(84)110)98-76(126)58(41-108)106-72(122)51(25-15-17-31-82)102-69(119)52(26-18-32-90-79(86)87)99-65(115)43(4)95-62(113)40-94-77(127)64(45(6)109)107-75(125)56(36-47-22-12-9-13-23-47)97-63(114)39-92-61(112)38-93-67(117)48(83)35-46-20-10-8-11-21-46/h8-13,20-23,42-45,48-58,64,108-109H,7,14-19,24-41,81-83H2,1-6H3,(H2,84,110)(H2,85,111)(H,92,112)(H,93,117)(H,94,127)(H,95,113)(H,96,123)(H,97,114)(H,98,126)(H,99,115)(H,100,118)(H,101,120)(H,102,119)(H,103,124)(H,104,116)(H,105,121)(H,106,122)(H,107,125)(H,128,129)(H4,86,87,90)(H4,88,89,91)/t43-,44-,45+,48-,49-,50-,51-,52-,53-,54-,55-,56-,57-,58-,64-/m0/s1
Reactome pathway
0.480n/an/an/an/an/an/an/an/a
Purdue Pharma L. P.
Curated by ChEMBL
Assay Description
Affinity for human Opioid receptor like 1 (ORL-1) expressed in HEK293 cells
J Med Chem 45: 5280-6 (2002)
BindingDB Entry DOI: 10.7270/Q2474BKJ
Nociceptin receptor
(Homo sapiens (Human))
BDBM50121250
(CHEMBL415584 | F-G-G-F-T-G-A-R-K-S-Aib-R-K-L-A-N-Q...)
Show SMILES CC[C@H](NC(=O)[C@H](CO)NC(=O)[C@H](CCCCN)NC(=O)[C@H](CCCNC(N)=N)NC(=O)[C@H](C)NC(=O)CNC(=O)[C@@H](NC(=O)[C@H](Cc1ccccc1)NC(=O)CNC(=O)CNC(=O)[C@@H](N)Cc1ccccc1)[C@@H](C)O)C(=O)N[C@@H](CCCNC(N)=N)C(=O)N[C@@H](CCCCN)C(=O)N[C@@H](CC(C)C)C(=O)N[C@@H](C)C(=O)N[C@@H](CC(N)=O)C(=O)N[C@@H](CCC(N)=O)C(O)=O
Show InChI InChI=1S/C80H131N27O22/c1-7-49(68(118)100-53(27-19-33-91-80(88)89)70(120)101-50(24-14-16-30-81)71(121)105-55(34-42(2)3)73(123)96-44(5)66(116)104-57(37-60(85)111)74(124)103-54(78(128)129)28-29-59(84)110)98-76(126)58(41-108)106-72(122)51(25-15-17-31-82)102-69(119)52(26-18-32-90-79(86)87)99-65(115)43(4)95-62(113)40-94-77(127)64(45(6)109)107-75(125)56(36-47-22-12-9-13-23-47)97-63(114)39-92-61(112)38-93-67(117)48(83)35-46-20-10-8-11-21-46/h8-13,20-23,42-45,48-58,64,108-109H,7,14-19,24-41,81-83H2,1-6H3,(H2,84,110)(H2,85,111)(H,92,112)(H,93,117)(H,94,127)(H,95,113)(H,96,123)(H,97,114)(H,98,126)(H,99,115)(H,100,118)(H,101,120)(H,102,119)(H,103,124)(H,104,116)(H,105,121)(H,106,122)(H,107,125)(H,128,129)(H4,86,87,90)(H4,88,89,91)/t43-,44-,45+,48-,49-,50-,51-,52-,53-,54-,55-,56-,57-,58-,64-/m0/s1
Reactome pathway
n/an/an/an/a 1n/an/an/an/a
Purdue Pharma L. P.
Curated by ChEMBL
Assay Description
Affinity for human Opioid receptor like 1 (ORL-1) expressed in HEK293 cells
J Med Chem 45: 5280-6 (2002)
BindingDB Entry DOI: 10.7270/Q2474BKJ