null
SMILES: CCCCC(CC(=N)NO)C(=O)N[C@H](C(=O)N(C)C)C(C)(C)C
InChI Key: InChIKey=ZDMXECWUWZELES-GLGOKHISSA-N
Activity Spreadsheet -- Enzyme Inhibition Constant Data from BindingDB
Found 1 hit for monomerid = 50121441
Trg + Lig
Ki
nM
ΔG°
kcal/mole
IC50
nM
Kd
nM
EC50/IC50
nM
koff
s-1
kon
M-1s-1
pHTemp
°C
Peptide deformylase, mitochondrial
(Homo sapiens (Human))
BDBM50121441
((R)-2-(N-Hydroxycarbamimidoylmethyl)-hexanoic acid...)
Show SMILES CCCCC(CC(=N)NO)C(=O)N[C@H](C(=O)N(C)C)C(C)(C)C
Show InChI InChI=1S/C16H32N4O3/c1-7-8-9-11(10-12(17)19-23)14(21)18-13(16(2,3)4)15(22)20(5)6/h11,13,23H,7-10H2,1-6H3,(H2,17,19)(H,18,21)/t11?,13-/m1/s1
n/an/a>1.00E+3n/an/an/an/an/an/a
British Biotech Pharmaceuticals Limited
Curated by ChEMBL
Assay Description
Compound was evaluated for inhibition of peptide deformylase, PDF.Ni of Escherichia coli
Bioorg Med Chem Lett 12: 3595-9 (2002)
BindingDB Entry DOI: 10.7270/Q2FJ2G4H