BDBM50121693 CHEMBL3617006
SMILES: Oc1ccc(CNC(=O)C2CCCC2)cc1O
InChI Key: InChIKey=DOASLAQSIJAEFF-UHFFFAOYSA-N
Data: 2 IC50
Activity Spreadsheet -- Enzyme Inhibition Constant Data from BindingDB
Found 2 hits for monomerid = 50121693
Trg + Lig
Ki
nM
ΔG°
kcal/mole
IC50
nM
Kd
nM
EC50/IC50
nM
koff
s-1
kon
M-1s-1
pHTemp
°C
Deoxyribonuclease-1
(Homo sapiens (Human))
BDBM50121693
(CHEMBL3617006)
Show SMILES Oc1ccc(CNC(=O)C2CCCC2)cc1O
Show InChI InChI=1S/C13H17NO3/c15-11-6-5-9(7-12(11)16)8-14-13(17)10-3-1-2-4-10/h5-7,10,15-16H,1-4,8H2,(H,14,17)
n/an/a>1.00E+5n/an/an/an/an/an/a
MRC Technology
Curated by ChEMBL
Assay Description
Inhibition of DNAse1 (unknown origin)
Bioorg Med Chem Lett 25: 4097-103 (2015)
BindingDB Entry DOI: 10.7270/Q2ST7RN9
Flap endonuclease 1
(Homo sapiens (Human))
BDBM50121693
(CHEMBL3617006)
Show SMILES Oc1ccc(CNC(=O)C2CCCC2)cc1O
Show InChI InChI=1S/C13H17NO3/c15-11-6-5-9(7-12(11)16)8-14-13(17)10-3-1-2-4-10/h5-7,10,15-16H,1-4,8H2,(H,14,17)
Reactome pathway
n/an/a>1.00E+5n/an/an/an/an/an/a
MRC Technology
Curated by ChEMBL
Assay Description
Inhibition of FEN1 (unknown origin)
Bioorg Med Chem Lett 25: 4097-103 (2015)
BindingDB Entry DOI: 10.7270/Q2ST7RN9