BDBM50121700 CHEMBL3616997
SMILES: Oc1ccc(CNC(=O)Cc2ccccc2)cc1O
InChI Key: InChIKey=WHTFHXCYBIAGLC-UHFFFAOYSA-N
Data: 2 IC50
Activity Spreadsheet -- Enzyme Inhibition Constant Data from BindingDB
Found 2 hits for monomerid = 50121700
Trg + Lig
Ki
nM
ΔG°
kcal/mole
IC50
nM
Kd
nM
EC50/IC50
nM
koff
s-1
kon
M-1s-1
pHTemp
°C
Deoxyribonuclease-1
(Homo sapiens (Human))
BDBM50121700
(CHEMBL3616997)
Show SMILES Oc1ccc(CNC(=O)Cc2ccccc2)cc1O
Show InChI InChI=1S/C15H15NO3/c17-13-7-6-12(8-14(13)18)10-16-15(19)9-11-4-2-1-3-5-11/h1-8,17-18H,9-10H2,(H,16,19)
n/an/a>1.00E+5n/an/an/an/an/an/a
MRC Technology
Curated by ChEMBL
Assay Description
Inhibition of DNAse1 (unknown origin)
Bioorg Med Chem Lett 25: 4097-103 (2015)
BindingDB Entry DOI: 10.7270/Q2ST7RN9
Flap endonuclease 1
(Homo sapiens (Human))
BDBM50121700
(CHEMBL3616997)
Show SMILES Oc1ccc(CNC(=O)Cc2ccccc2)cc1O
Show InChI InChI=1S/C15H15NO3/c17-13-7-6-12(8-14(13)18)10-16-15(19)9-11-4-2-1-3-5-11/h1-8,17-18H,9-10H2,(H,16,19)
Reactome pathway
n/an/a>1.00E+5n/an/an/an/an/an/a
MRC Technology
Curated by ChEMBL
Assay Description
Inhibition of FEN1 (unknown origin)
Bioorg Med Chem Lett 25: 4097-103 (2015)
BindingDB Entry DOI: 10.7270/Q2ST7RN9