BDBM50121883 CHEMBL3617286
SMILES: CC(C)CCNC(=O)c1nc([nH]c(=O)c1O)-c1ccc(CN2CCOCC2)cc1
InChI Key: InChIKey=DRIMKGJHOXRCIC-UHFFFAOYSA-N
Data: 1 IC50
Activity Spreadsheet -- Enzyme Inhibition Constant Data from BindingDB
Found 1 hit for monomerid = 50121883
Trg + Lig
Ki
nM
ΔG°
kcal/mole
IC50
nM
Kd
nM
EC50/IC50
nM
koff
s-1
kon
M-1s-1
pHTemp
°C
Flap endonuclease 1
(Homo sapiens (Human))
BDBM50121883
(CHEMBL3617286)
Show SMILES CC(C)CCNC(=O)c1nc([nH]c(=O)c1O)-c1ccc(CN2CCOCC2)cc1
Show InChI InChI=1S/C21H28N4O4/c1-14(2)7-8-22-20(27)17-18(26)21(28)24-19(23-17)16-5-3-15(4-6-16)13-25-9-11-29-12-10-25/h3-6,14,26H,7-13H2,1-2H3,(H,22,27)(H,23,24,28)
Reactome pathway
n/an/a 3.81E+4n/an/an/an/an/an/a
MRC Technology
Curated by ChEMBL
Assay Description
Inhibition of FEN1 (unknown origin)
Bioorg Med Chem Lett 25: 4104-8 (2015)
BindingDB Entry DOI: 10.7270/Q28S4RQ2