BDBM50122073 Ac-His-D-Phe-Arg-Nal(1')-NH2::CHEMBL154153
SMILES: CC(=O)N[C@@H](Cc1cnc[nH]1)C(=O)N[C@@H](Cc1ccccc1)C(=O)N[C@@H](CCCNC(N)=N)C(=O)N[C@H](Cc1cccc2ccccc12)C(N)=O
InChI Key: InChIKey=ZOSNQMLKRGKNRN-JVVMDBNWSA-N
Data: 4 EC50
Activity Spreadsheet -- Enzyme Inhibition Constant Data from BindingDB
Found 4 hits for monomerid = 50122073
Trg + Lig
Ki
nM
ΔG°
kcal/mole
IC50
nM
Kd
nM
EC50/IC50
nM
koff
s-1
kon
M-1s-1
pHTemp
°C
Melanocortin receptor 1
(Mus musculus)
BDBM50122073
(Ac-His-D-Phe-Arg-Nal(1')-NH2 | CHEMBL154153)
Show SMILES CC(=O)N[C@@H](Cc1cnc[nH]1)C(=O)N[C@@H](Cc1ccccc1)C(=O)N[C@@H](CCCNC(N)=N)C(=O)N[C@H](Cc1cccc2ccccc12)C(N)=O
Show InChI InChI=1S/C36H44N10O5/c1-22(47)43-31(19-26-20-40-21-42-26)35(51)46-30(17-23-9-3-2-4-10-23)34(50)44-28(15-8-16-41-36(38)39)33(49)45-29(32(37)48)18-25-13-7-12-24-11-5-6-14-27(24)25/h2-7,9-14,20-21,28-31H,8,15-19H2,1H3,(H2,37,48)(H,40,42)(H,43,47)(H,44,50)(H,45,49)(H,46,51)(H4,38,39,41)/t28-,29+,30-,31-/m0/s1
n/an/an/an/a 730n/an/an/an/a
University of Florida
Curated by ChEMBL
Assay Description
Activity in mouse melanocortin-1 receptor stably expressed in HEK293 cells
J Med Chem 45: 5736-44 (2002)
BindingDB Entry DOI: 10.7270/Q2Q2410R
Melanocortin receptor 5 (MC5R)
(Mus musculus (Mouse))
BDBM50122073
(Ac-His-D-Phe-Arg-Nal(1')-NH2 | CHEMBL154153)
Show SMILES CC(=O)N[C@@H](Cc1cnc[nH]1)C(=O)N[C@@H](Cc1ccccc1)C(=O)N[C@@H](CCCNC(N)=N)C(=O)N[C@H](Cc1cccc2ccccc12)C(N)=O
Show InChI InChI=1S/C36H44N10O5/c1-22(47)43-31(19-26-20-40-21-42-26)35(51)46-30(17-23-9-3-2-4-10-23)34(50)44-28(15-8-16-41-36(38)39)33(49)45-29(32(37)48)18-25-13-7-12-24-11-5-6-14-27(24)25/h2-7,9-14,20-21,28-31H,8,15-19H2,1H3,(H2,37,48)(H,40,42)(H,43,47)(H,44,50)(H,45,49)(H,46,51)(H4,38,39,41)/t28-,29+,30-,31-/m0/s1
n/an/an/an/a 33.1n/an/an/an/a
University of Florida
Curated by ChEMBL
Assay Description
Activity in mouse melanocortin-5 receptor stably expressed in HEK293 cells
J Med Chem 45: 5736-44 (2002)
BindingDB Entry DOI: 10.7270/Q2Q2410R
Melanocortin receptor 4
(Mus musculus)
BDBM50122073
(Ac-His-D-Phe-Arg-Nal(1')-NH2 | CHEMBL154153)
Show SMILES CC(=O)N[C@@H](Cc1cnc[nH]1)C(=O)N[C@@H](Cc1ccccc1)C(=O)N[C@@H](CCCNC(N)=N)C(=O)N[C@H](Cc1cccc2ccccc12)C(N)=O
Show InChI InChI=1S/C36H44N10O5/c1-22(47)43-31(19-26-20-40-21-42-26)35(51)46-30(17-23-9-3-2-4-10-23)34(50)44-28(15-8-16-41-36(38)39)33(49)45-29(32(37)48)18-25-13-7-12-24-11-5-6-14-27(24)25/h2-7,9-14,20-21,28-31H,8,15-19H2,1H3,(H2,37,48)(H,40,42)(H,43,47)(H,44,50)(H,45,49)(H,46,51)(H4,38,39,41)/t28-,29+,30-,31-/m0/s1
n/an/an/an/a 260n/an/an/an/a
University of Florida
Curated by ChEMBL
Assay Description
Activity in mouse melanocortin-4 receptor stably expressed in HEK293 cells
J Med Chem 45: 5736-44 (2002)
BindingDB Entry DOI: 10.7270/Q2Q2410R
Melanocortin receptor 3
(Mus musculus)
BDBM50122073
(Ac-His-D-Phe-Arg-Nal(1')-NH2 | CHEMBL154153)
Show SMILES CC(=O)N[C@@H](Cc1cnc[nH]1)C(=O)N[C@@H](Cc1ccccc1)C(=O)N[C@@H](CCCNC(N)=N)C(=O)N[C@H](Cc1cccc2ccccc12)C(N)=O
Show InChI InChI=1S/C36H44N10O5/c1-22(47)43-31(19-26-20-40-21-42-26)35(51)46-30(17-23-9-3-2-4-10-23)34(50)44-28(15-8-16-41-36(38)39)33(49)45-29(32(37)48)18-25-13-7-12-24-11-5-6-14-27(24)25/h2-7,9-14,20-21,28-31H,8,15-19H2,1H3,(H2,37,48)(H,40,42)(H,43,47)(H,44,50)(H,45,49)(H,46,51)(H4,38,39,41)/t28-,29+,30-,31-/m0/s1
Reactome pathway
n/an/an/an/a 3.50E+3n/an/an/an/a
University of Florida
Curated by ChEMBL
Assay Description
Activity in mouse melanocortin-3 receptor (mMC3R) stably expressed in HEK293 cells
J Med Chem 45: 5736-44 (2002)
BindingDB Entry DOI: 10.7270/Q2Q2410R