null
SMILES: C[C@@H]1CN(C(=O)c2cc(COc3ccc(Cl)cn3)nn12)c1cccc(F)n1
InChI Key: InChIKey=GHEHJUABDKEKSE-LLVKDONJSA-N
Activity Spreadsheet -- Enzyme Inhibition Constant Data from BindingDB
Found 4 hits for monomerid = 50122175
Trg + Lig
Ki
nM
ΔG°
kcal/mole
IC50
nM
Kd
nM
EC50/IC50
nM
koff
s-1
kon
M-1s-1
pHTemp
°C
Metabotropic glutamate receptor 3
(Rattus norvegicus (Rat))
BDBM50122175
(CHEMBL3616489)
Show SMILES C[C@@H]1CN(C(=O)c2cc(COc3ccc(Cl)cn3)nn12)c1cccc(F)n1 |r|
Show InChI InChI=1S/C18H15ClFN5O2/c1-11-9-24(16-4-2-3-15(20)22-16)18(26)14-7-13(23-25(11)14)10-27-17-6-5-12(19)8-21-17/h2-8,11H,9-10H2,1H3/t11-/m1/s1
n/an/a 295n/an/an/an/an/an/a
Vanderbilt University Medical Center
Curated by ChEMBL
Assay Description
Negative allosteric modulation of rat mGlu3 receptor assessed as calcium mobilization by cell based fluorescence assay
J Med Chem 58: 7485-500 (2015)
BindingDB Entry DOI: 10.7270/Q2H9970P
Metabotropic glutamate receptor 5
(Rattus norvegicus (Rat))
BDBM50122175
(CHEMBL3616489)
Show SMILES C[C@@H]1CN(C(=O)c2cc(COc3ccc(Cl)cn3)nn12)c1cccc(F)n1 |r|
Show InChI InChI=1S/C18H15ClFN5O2/c1-11-9-24(16-4-2-3-15(20)22-16)18(26)14-7-13(23-25(11)14)10-27-17-6-5-12(19)8-21-17/h2-8,11H,9-10H2,1H3/t11-/m1/s1
Reactome pathway
n/an/an/an/a<1.00E+4n/an/an/an/a
Vanderbilt University Medical Center
Curated by ChEMBL
Assay Description
Modulation of rat mGlu5 receptor assessed as calcium mobilization by cell based fluorescence assay
J Med Chem 58: 7485-500 (2015)
BindingDB Entry DOI: 10.7270/Q2H9970P
Metabotropic glutamate receptor 5
(Rattus norvegicus (Rat))
BDBM50122175
(CHEMBL3616489)
Show SMILES C[C@@H]1CN(C(=O)c2cc(COc3ccc(Cl)cn3)nn12)c1cccc(F)n1 |r|
Show InChI InChI=1S/C18H15ClFN5O2/c1-11-9-24(16-4-2-3-15(20)22-16)18(26)14-7-13(23-25(11)14)10-27-17-6-5-12(19)8-21-17/h2-8,11H,9-10H2,1H3/t11-/m1/s1
Reactome pathway
n/an/an/an/a>1.00E+4n/an/an/an/a
Vanderbilt University Medical Center
Curated by ChEMBL
Assay Description
Modulation of rat mGlu5 receptor assessed as calcium mobilization by cell based fluorescence assay
J Med Chem 58: 7485-500 (2015)
BindingDB Entry DOI: 10.7270/Q2H9970P
Metabotropic glutamate receptor 3
(Rattus norvegicus (Rat))
BDBM50122175
(CHEMBL3616489)
Show SMILES C[C@@H]1CN(C(=O)c2cc(COc3ccc(Cl)cn3)nn12)c1cccc(F)n1 |r|
Show InChI InChI=1S/C18H15ClFN5O2/c1-11-9-24(16-4-2-3-15(20)22-16)18(26)14-7-13(23-25(11)14)10-27-17-6-5-12(19)8-21-17/h2-8,11H,9-10H2,1H3/t11-/m1/s1
n/an/a 294n/an/an/an/an/an/a
Vanderbilt University Medical Center
Curated by ChEMBL
Assay Description
Negative allosteric modulation of rat mGlu3 receptor assessed as calcium mobilization by cell based fluorescence assay
J Med Chem 58: 7485-500 (2015)
BindingDB Entry DOI: 10.7270/Q2H9970P