null
SMILES: C[C@@H]1CN(C(=O)c2cc(COc3ccc(F)cn3)nn12)c1cc(F)ccc1F
InChI Key: InChIKey=XNFBWAVTBOEFJJ-LLVKDONJSA-N
Activity Spreadsheet -- Enzyme Inhibition Constant Data from BindingDB
Found 4 hits for monomerid = 50122268
Trg + Lig
Ki
nM
ΔG°
kcal/mole
IC50
nM
Kd
nM
EC50/IC50
nM
koff
s-1
kon
M-1s-1
pHTemp
°C
Metabotropic glutamate receptor 3
(Rattus norvegicus (Rat))
BDBM50122268
(CHEMBL3617624)
Show SMILES C[C@@H]1CN(C(=O)c2cc(COc3ccc(F)cn3)nn12)c1cc(F)ccc1F |r|
Show InChI InChI=1S/C19H15F3N4O2/c1-11-9-25(16-6-12(20)2-4-15(16)22)19(27)17-7-14(24-26(11)17)10-28-18-5-3-13(21)8-23-18/h2-8,11H,9-10H2,1H3/t11-/m1/s1
n/an/a 123n/an/an/an/an/an/a
Vanderbilt University Medical Center
Curated by ChEMBL
Assay Description
Negative allosteric modulation of rat mGlu3 receptor assessed as calcium mobilization by cell based fluorescence assay
J Med Chem 58: 7485-500 (2015)
BindingDB Entry DOI: 10.7270/Q2H9970P
Metabotropic glutamate receptor 5
(Rattus norvegicus (Rat))
BDBM50122268
(CHEMBL3617624)
Show SMILES C[C@@H]1CN(C(=O)c2cc(COc3ccc(F)cn3)nn12)c1cc(F)ccc1F |r|
Show InChI InChI=1S/C19H15F3N4O2/c1-11-9-25(16-6-12(20)2-4-15(16)22)19(27)17-7-14(24-26(11)17)10-28-18-5-3-13(21)8-23-18/h2-8,11H,9-10H2,1H3/t11-/m1/s1
Reactome pathway
n/an/an/an/a>1.00E+4n/an/an/an/a
Vanderbilt University Medical Center
Curated by ChEMBL
Assay Description
Modulation of rat mGlu5 receptor assessed as calcium mobilization by cell based fluorescence assay
J Med Chem 58: 7485-500 (2015)
BindingDB Entry DOI: 10.7270/Q2H9970P
Metabotropic glutamate receptor 3
(Rattus norvegicus (Rat))
BDBM50122268
(CHEMBL3617624)
Show SMILES C[C@@H]1CN(C(=O)c2cc(COc3ccc(F)cn3)nn12)c1cc(F)ccc1F |r|
Show InChI InChI=1S/C19H15F3N4O2/c1-11-9-25(16-6-12(20)2-4-15(16)22)19(27)17-7-14(24-26(11)17)10-28-18-5-3-13(21)8-23-18/h2-8,11H,9-10H2,1H3/t11-/m1/s1
n/an/a 123n/an/an/an/an/an/a
Vanderbilt University Medical Center
Curated by ChEMBL
Assay Description
Negative allosteric modulation of rat mGlu3 receptor assessed as calcium mobilization by cell based fluorescence assay
J Med Chem 58: 7485-500 (2015)
BindingDB Entry DOI: 10.7270/Q2H9970P
Metabotropic glutamate receptor 5
(Rattus norvegicus (Rat))
BDBM50122268
(CHEMBL3617624)
Show SMILES C[C@@H]1CN(C(=O)c2cc(COc3ccc(F)cn3)nn12)c1cc(F)ccc1F |r|
Show InChI InChI=1S/C19H15F3N4O2/c1-11-9-25(16-6-12(20)2-4-15(16)22)19(27)17-7-14(24-26(11)17)10-28-18-5-3-13(21)8-23-18/h2-8,11H,9-10H2,1H3/t11-/m1/s1
Reactome pathway
n/an/an/an/a<1.00E+4n/an/an/an/a
Vanderbilt University Medical Center
Curated by ChEMBL
Assay Description
Modulation of rat mGlu5 receptor assessed as calcium mobilization by cell based fluorescence assay
J Med Chem 58: 7485-500 (2015)
BindingDB Entry DOI: 10.7270/Q2H9970P