BDBM50122273 CHEMBL3617619
SMILES: C[C@@H]1CN(C(=O)c2cc(COc3ccc(F)cn3)nn12)c1ccc(C)cc1
InChI Key: InChIKey=BPHWUMREZIPGSU-CQSZACIVSA-N
Data: 2 IC50  2 EC50
Activity Spreadsheet -- Enzyme Inhibition Constant Data from BindingDB
Found 4 hits for monomerid = 50122273
Trg + Lig
Ki
nM
ΔG°
kcal/mole
IC50
nM
Kd
nM
EC50/IC50
nM
koff
s-1
kon
M-1s-1
pHTemp
°C
Metabotropic glutamate receptor 3
(Rattus norvegicus (Rat))
BDBM50122273
(CHEMBL3617619)
Show SMILES C[C@@H]1CN(C(=O)c2cc(COc3ccc(F)cn3)nn12)c1ccc(C)cc1 |r|
Show InChI InChI=1S/C20H19FN4O2/c1-13-3-6-17(7-4-13)24-11-14(2)25-18(20(24)26)9-16(23-25)12-27-19-8-5-15(21)10-22-19/h3-10,14H,11-12H2,1-2H3/t14-/m1/s1
n/an/a 269n/an/an/an/an/an/a
Vanderbilt University Medical Center
Curated by ChEMBL
Assay Description
Negative allosteric modulation of rat mGlu3 receptor assessed as calcium mobilization by cell based fluorescence assay
J Med Chem 58: 7485-500 (2015)
BindingDB Entry DOI: 10.7270/Q2H9970P
Metabotropic glutamate receptor
(Rattus norvegicus (Rat))
BDBM50122273
(CHEMBL3617619)
Show SMILES C[C@@H]1CN(C(=O)c2cc(COc3ccc(F)cn3)nn12)c1ccc(C)cc1 |r|
Show InChI InChI=1S/C20H19FN4O2/c1-13-3-6-17(7-4-13)24-11-14(2)25-18(20(24)26)9-16(23-25)12-27-19-8-5-15(21)10-22-19/h3-10,14H,11-12H2,1-2H3/t14-/m1/s1
Reactome pathway
n/an/an/an/a>1.00E+4n/an/an/an/a
Vanderbilt University Medical Center
Curated by ChEMBL
Assay Description
Modulation of rat mGlu5 receptor assessed as calcium mobilization by cell based fluorescence assay
J Med Chem 58: 7485-500 (2015)
BindingDB Entry DOI: 10.7270/Q2H9970P
Metabotropic glutamate receptor 3
(Rattus norvegicus (Rat))
BDBM50122273
(CHEMBL3617619)
Show SMILES C[C@@H]1CN(C(=O)c2cc(COc3ccc(F)cn3)nn12)c1ccc(C)cc1 |r|
Show InChI InChI=1S/C20H19FN4O2/c1-13-3-6-17(7-4-13)24-11-14(2)25-18(20(24)26)9-16(23-25)12-27-19-8-5-15(21)10-22-19/h3-10,14H,11-12H2,1-2H3/t14-/m1/s1
n/an/a 269n/an/an/an/an/an/a
Vanderbilt University Medical Center
Curated by ChEMBL
Assay Description
Negative allosteric modulation of rat mGlu3 receptor assessed as calcium mobilization by cell based fluorescence assay
J Med Chem 58: 7485-500 (2015)
BindingDB Entry DOI: 10.7270/Q2H9970P
Metabotropic glutamate receptor
(Rattus norvegicus (Rat))
BDBM50122273
(CHEMBL3617619)
Show SMILES C[C@@H]1CN(C(=O)c2cc(COc3ccc(F)cn3)nn12)c1ccc(C)cc1 |r|
Show InChI InChI=1S/C20H19FN4O2/c1-13-3-6-17(7-4-13)24-11-14(2)25-18(20(24)26)9-16(23-25)12-27-19-8-5-15(21)10-22-19/h3-10,14H,11-12H2,1-2H3/t14-/m1/s1
Reactome pathway
n/an/an/an/a<1.00E+4n/an/an/an/a
Vanderbilt University Medical Center
Curated by ChEMBL
Assay Description
Modulation of rat mGlu5 receptor assessed as calcium mobilization by cell based fluorescence assay
J Med Chem 58: 7485-500 (2015)
BindingDB Entry DOI: 10.7270/Q2H9970P