BDBM50122391 5-(2-Chloro-phenyl)-1-(2,6-dichloro-phenyl)-7-(piperidin-4-ylamino)-3,4-dihydro-1H-quinazolin-2-one::5-(2-chlorophenyl)-1-(2,6-dichlorophenyl)-7-(piperidin-4-ylamino)-3,4-dihydroquinazolin-2(1H)-one::CHEMBL327987
SMILES: Clc1ccccc1-c1cc(NC2CCNCC2)cc2N(C(=O)NCc12)c1c(Cl)cccc1Cl
InChI Key: InChIKey=KYTWYELKTBDZFP-UHFFFAOYSA-N
Data: 5 IC50
Activity Spreadsheet -- Enzyme Inhibition Constant Data from BindingDB
Found 5 hits for monomerid = 50122391
Trg + Lig
Ki
nM
ΔG°
kcal/mole
IC50
nM
Kd
nM
EC50/IC50
nM
koff
s-1
kon
M-1s-1
pHTemp
°C
Mitogen-activated protein kinase 14
(Homo sapiens (Human))
BDBM50122391
(5-(2-Chloro-phenyl)-1-(2,6-dichloro-phenyl)-7-(pip...)
Show SMILES Clc1ccccc1-c1cc(NC2CCNCC2)cc2N(C(=O)NCc12)c1c(Cl)cccc1Cl
Show InChI InChI=1S/C25H23Cl3N4O/c26-20-5-2-1-4-17(20)18-12-16(31-15-8-10-29-11-9-15)13-23-19(18)14-30-25(33)32(23)24-21(27)6-3-7-22(24)28/h1-7,12-13,15,29,31H,8-11,14H2,(H,30,33)
NCI pathway
Reactome pathway
n/an/a 0.5n/an/an/an/an/an/a
Merck Research Laboratories
Curated by ChEMBL
Assay Description
Inhibitory activity against mitogen-activated protein kinase p38 alpha
Bioorg Med Chem Lett 13: 277-80 (2002)
BindingDB Entry DOI: 10.7270/Q25X2884
Mitogen-activated protein kinase 14
(Homo sapiens (Human))
BDBM50122391
(5-(2-Chloro-phenyl)-1-(2,6-dichloro-phenyl)-7-(pip...)
Show SMILES Clc1ccccc1-c1cc(NC2CCNCC2)cc2N(C(=O)NCc12)c1c(Cl)cccc1Cl
Show InChI InChI=1S/C25H23Cl3N4O/c26-20-5-2-1-4-17(20)18-12-16(31-15-8-10-29-11-9-15)13-23-19(18)14-30-25(33)32(23)24-21(27)6-3-7-22(24)28/h1-7,12-13,15,29,31H,8-11,14H2,(H,30,33)
NCI pathway
Reactome pathway
n/an/a 0.5n/an/an/an/an/an/a
University of Zurich
Curated by ChEMBL
Assay Description
Inhibition of p38alpha
J Med Chem 51: 1179-88 (2008)
Article DOI: 10.1021/jm070654j
BindingDB Entry DOI: 10.7270/Q29Z95RD
Mitogen-activated protein kinase 14
(Homo sapiens (Human))
BDBM50122391
(5-(2-Chloro-phenyl)-1-(2,6-dichloro-phenyl)-7-(pip...)
Show SMILES Clc1ccccc1-c1cc(NC2CCNCC2)cc2N(C(=O)NCc12)c1c(Cl)cccc1Cl
Show InChI InChI=1S/C25H23Cl3N4O/c26-20-5-2-1-4-17(20)18-12-16(31-15-8-10-29-11-9-15)13-23-19(18)14-30-25(33)32(23)24-21(27)6-3-7-22(24)28/h1-7,12-13,15,29,31H,8-11,14H2,(H,30,33)
NCI pathway
Reactome pathway
n/an/a 0.500n/an/an/an/an/an/a
TBA
Assay Description
Inhibition of p38alpha MAPK (unknown origin)
Citation and Details
Article DOI: 10.1007/s00044-012-0179-7
BindingDB Entry DOI: 10.7270/Q2WW7MMT
MAP kinase p38
(Homo sapiens (Human))
BDBM50122391
(5-(2-Chloro-phenyl)-1-(2,6-dichloro-phenyl)-7-(pip...)
Show SMILES Clc1ccccc1-c1cc(NC2CCNCC2)cc2N(C(=O)NCc12)c1c(Cl)cccc1Cl
Show InChI InChI=1S/C25H23Cl3N4O/c26-20-5-2-1-4-17(20)18-12-16(31-15-8-10-29-11-9-15)13-23-19(18)14-30-25(33)32(23)24-21(27)6-3-7-22(24)28/h1-7,12-13,15,29,31H,8-11,14H2,(H,30,33)
n/an/a 0.5n/an/an/an/an/an/a
Merck& Co.
Curated by ChEMBL
Assay Description
Inhibition of p38 MAP kinase
Bioorg Med Chem Lett 13: 467-70 (2003)
BindingDB Entry DOI: 10.7270/Q22F7QM4
MAP kinase p38
(Homo sapiens (Human))
BDBM50122391
(5-(2-Chloro-phenyl)-1-(2,6-dichloro-phenyl)-7-(pip...)
Show SMILES Clc1ccccc1-c1cc(NC2CCNCC2)cc2N(C(=O)NCc12)c1c(Cl)cccc1Cl
Show InChI InChI=1S/C25H23Cl3N4O/c26-20-5-2-1-4-17(20)18-12-16(31-15-8-10-29-11-9-15)13-23-19(18)14-30-25(33)32(23)24-21(27)6-3-7-22(24)28/h1-7,12-13,15,29,31H,8-11,14H2,(H,30,33)
n/an/a 36n/an/an/an/an/an/a
Merck& Co.
Curated by ChEMBL
Assay Description
Inhibition of p38 kinase related TNF-alpha release
Bioorg Med Chem Lett 13: 467-70 (2003)
BindingDB Entry DOI: 10.7270/Q22F7QM4