BDBM50122486 CHEMBL3622481
SMILES: CCN(C(=O)c1ccc(CNc2nc(NC)nc(n2)N2CCc3cc(OC)c(OC)cc3C2)cc1)c1cccc(C)c1
InChI Key: InChIKey=IYGGTOCJJOTNES-UHFFFAOYSA-N
Data: 1 IC50
Activity Spreadsheet -- Enzyme Inhibition Constant Data from BindingDB
Found 1 hit for monomerid = 50122486
Trg + Lig
Ki
nM
ΔG°
kcal/mole
IC50
nM
Kd
nM
EC50/IC50
nM
koff
s-1
kon
M-1s-1
pHTemp
°C
A disintegrin and metalloproteinase with thrombospondin motifs 4 (ADAMTS-4)
(Homo sapiens (Human))
BDBM50122486
(CHEMBL3622481)
Show SMILES CCN(C(=O)c1ccc(CNc2nc(NC)nc(n2)N2CCc3cc(OC)c(OC)cc3C2)cc1)c1cccc(C)c1
Show InChI InChI=1S/C32H37N7O3/c1-6-39(26-9-7-8-21(2)16-26)29(40)23-12-10-22(11-13-23)19-34-31-35-30(33-3)36-32(37-31)38-15-14-24-17-27(41-4)28(42-5)18-25(24)20-38/h7-13,16-18H,6,14-15,19-20H2,1-5H3,(H2,33,34,35,36,37)
Reactome pathway
n/an/a 30n/an/an/an/an/an/a
GlaxoSmithKline
Curated by ChEMBL
Assay Description
Inhibition of recombinant human ADAMTS4 (213 to 575 amino acid residues) using WAAG-3R as substrate preincubated for 15 mins followed by substrate ad...
ACS Med Chem Lett 6: 888-93 (2015)
BindingDB Entry DOI: 10.7270/Q2416ZWQ