BDBM50122493 CHEMBL3622494
SMILES: CCN(C(=O)c1ccc(CNc2ncnc(n2)N2CCc3cc(F)ccc3C2)cc1)c1cccc(C)c1
InChI Key: InChIKey=YJKZMNRVNNOJMV-UHFFFAOYSA-N
Data: 1 IC50
Activity Spreadsheet -- Enzyme Inhibition Constant Data from BindingDB
Found 1 hit for monomerid = 50122493
Trg + Lig
Ki
nM
ΔG°
kcal/mole
IC50
nM
Kd
nM
EC50/IC50
nM
koff
s-1
kon
M-1s-1
pHTemp
°C
A disintegrin and metalloproteinase with thrombospondin motifs 4 (ADAMTS-4)
(Homo sapiens (Human))
BDBM50122493
(CHEMBL3622494)
Show SMILES CCN(C(=O)c1ccc(CNc2ncnc(n2)N2CCc3cc(F)ccc3C2)cc1)c1cccc(C)c1
Show InChI InChI=1S/C29H29FN6O/c1-3-36(26-6-4-5-20(2)15-26)27(37)22-9-7-21(8-10-22)17-31-28-32-19-33-29(34-28)35-14-13-23-16-25(30)12-11-24(23)18-35/h4-12,15-16,19H,3,13-14,17-18H2,1-2H3,(H,31,32,33,34)
Reactome pathway
n/an/a 370n/an/an/an/an/an/a
GlaxoSmithKline
Curated by ChEMBL
Assay Description
Inhibition of recombinant human ADAMTS4 (213 to 575 amino acid residues) using WAAG-3R as substrate preincubated for 15 mins followed by substrate ad...
ACS Med Chem Lett 6: 888-93 (2015)
BindingDB Entry DOI: 10.7270/Q2416ZWQ