BDBM50122572 But-2-ynoic acid [4-(3-bromo-phenylamino)-3-cyano-7-methoxy-quinolin-6-yl]-amide::CHEMBL116525
SMILES: COc1cc2ncc(C#N)c(Nc3cccc(Br)c3)c2cc1NC(=O)C#CC
InChI Key: InChIKey=PLQLHGCLAWKBJG-UHFFFAOYSA-N
Data: 5 IC50
Activity Spreadsheet -- Enzyme Inhibition Constant Data from BindingDB
Found 5 hits for monomerid = 50122572
Trg + Lig
Ki
nM
ΔG°
kcal/mole
IC50
nM
Kd
nM
EC50/IC50
nM
koff
s-1
kon
M-1s-1
pHTemp
°C
Epidermal growth factor receptor
(Homo sapiens (Human))
BDBM50122572
(But-2-ynoic acid [4-(3-bromo-phenylamino)-3-cyano-...)
Show SMILES COc1cc2ncc(C#N)c(Nc3cccc(Br)c3)c2cc1NC(=O)C#CC
Show InChI InChI=1S/C21H15BrN4O2/c1-3-5-20(27)26-18-9-16-17(10-19(18)28-2)24-12-13(11-23)21(16)25-15-7-4-6-14(22)8-15/h4,6-10,12H,1-2H3,(H,24,25)(H,26,27)
n/an/a 910n/an/an/an/an/an/a
Georgetown University
Curated by ChEMBL
Assay Description
Concentration required to inhibit autophosphorylation of cytoplasmic domain of epidermal growth factor receptor (EGFR)
Bioorg Med Chem Lett 14: 3397-400 (2004)
Article DOI: 10.1016/j.bmcl.2004.04.080
BindingDB Entry DOI: 10.7270/Q21Z4505
Receptor tyrosine-protein kinase erbB-2
(Homo sapiens (Human))
BDBM50122572
(But-2-ynoic acid [4-(3-bromo-phenylamino)-3-cyano-...)
Show SMILES COc1cc2ncc(C#N)c(Nc3cccc(Br)c3)c2cc1NC(=O)C#CC
Show InChI InChI=1S/C21H15BrN4O2/c1-3-5-20(27)26-18-9-16-17(10-19(18)28-2)24-12-13(11-23)21(16)25-15-7-4-6-14(22)8-15/h4,6-10,12H,1-2H3,(H,24,25)(H,26,27)
n/an/a 2.12E+3n/an/an/an/an/an/a
Wyeth Research
Curated by ChEMBL
Assay Description
Concentration required to inhibit autophosphorylation of cytoplasmic domain of human epidermal growth factor receptor-2
J Med Chem 46: 49-63 (2002)
Article DOI: 10.1021/jm020241c
BindingDB Entry DOI: 10.7270/Q2PV6M3H
Epidermal growth factor receptor
(Homo sapiens (Human))
BDBM50122572
(But-2-ynoic acid [4-(3-bromo-phenylamino)-3-cyano-...)
Show SMILES COc1cc2ncc(C#N)c(Nc3cccc(Br)c3)c2cc1NC(=O)C#CC
Show InChI InChI=1S/C21H15BrN4O2/c1-3-5-20(27)26-18-9-16-17(10-19(18)28-2)24-12-13(11-23)21(16)25-15-7-4-6-14(22)8-15/h4,6-10,12H,1-2H3,(H,24,25)(H,26,27)
n/an/a 1.90E+5n/an/an/an/an/an/a
TBA
Assay Description
Inhibition of EGFR (unknown origin)
Citation and Details
Article DOI: 10.1007/s00044-004-0105-8
BindingDB Entry DOI: 10.7270/Q2NZ8BJH
Epidermal growth factor receptor
(Homo sapiens (Human))
BDBM50122572
(But-2-ynoic acid [4-(3-bromo-phenylamino)-3-cyano-...)
Show SMILES COc1cc2ncc(C#N)c(Nc3cccc(Br)c3)c2cc1NC(=O)C#CC
Show InChI InChI=1S/C21H15BrN4O2/c1-3-5-20(27)26-18-9-16-17(10-19(18)28-2)24-12-13(11-23)21(16)25-15-7-4-6-14(22)8-15/h4,6-10,12H,1-2H3,(H,24,25)(H,26,27)
n/an/a 912n/an/an/an/an/an/a
Korea Institute of Science and Technology
Curated by ChEMBL
Assay Description
Inhibition autophosphorylation of EGFR in human DiFi cells after 2 hrs by ELISA
Eur J Med Chem 43: 781-91 (2008)
Article DOI: 10.1016/j.ejmech.2007.06.006
BindingDB Entry DOI: 10.7270/Q2DJ5GXN
Epidermal growth factor receptor
(Homo sapiens (Human))
BDBM50122572
(But-2-ynoic acid [4-(3-bromo-phenylamino)-3-cyano-...)
Show SMILES COc1cc2ncc(C#N)c(Nc3cccc(Br)c3)c2cc1NC(=O)C#CC
Show InChI InChI=1S/C21H15BrN4O2/c1-3-5-20(27)26-18-9-16-17(10-19(18)28-2)24-12-13(11-23)21(16)25-15-7-4-6-14(22)8-15/h4,6-10,12H,1-2H3,(H,24,25)(H,26,27)
n/an/a 910n/an/an/an/an/an/a
Wyeth Research
Curated by ChEMBL
Assay Description
Inhibition of autophosphorylation of cytoplasmic domain of epidermal growth factor receptor
J Med Chem 46: 49-63 (2002)
Article DOI: 10.1021/jm020241c
BindingDB Entry DOI: 10.7270/Q2PV6M3H