BDBM50122643 CHEMBL3623122
SMILES: [H][C@]12C(=O)N(C(=O)[C@@]1([H])[C@@]1(C)O[C@]2(C)C[C@H]1NC(=O)ON1CCN(C)CC1)c1ccc(C#N)c(c1)C(F)(F)F
InChI Key: InChIKey=FDOZCOHQLJREEL-KIRBEMFZSA-N
Data: 1 KI  1 IC50
Activity Spreadsheet -- Enzyme Inhibition Constant Data from BindingDB
Found 2 hits for monomerid = 50122643
Trg + Lig
Ki
nM
ΔG°
kcal/mole
IC50
nM
Kd
nM
EC50/IC50
nM
koff
s-1
kon
M-1s-1
pHTemp
°C
Androgen receptor
(Homo sapiens (Human))
BDBM50122643
(CHEMBL3623122)
Show SMILES [H][C@]12C(=O)N(C(=O)[C@@]1([H])[C@@]1(C)O[C@]2(C)C[C@H]1NC(=O)ON1CCN(C)CC1)c1ccc(C#N)c(c1)C(F)(F)F |r,TLB:16:15:1.7:11|
Show InChI InChI=1S/C24H26F3N5O5/c1-22-11-16(29-21(35)36-31-8-6-30(3)7-9-31)23(2,37-22)18-17(22)19(33)32(20(18)34)14-5-4-13(12-28)15(10-14)24(25,26)27/h4-5,10,16-18H,6-9,11H2,1-3H3,(H,29,35)/t16-,17-,18+,22+,23+/m1/s1
NCI pathway
Reactome pathway
7n/an/an/an/an/an/an/an/a
Bristol Myers-Squibb Research and Development
Curated by ChEMBL
Assay Description
Displacement of [3H]-DHT from androgen receptor in human MDA-MB-453 cells after 90 mins by TopCount analysis
ACS Med Chem Lett 6: 908-12 (2015)
BindingDB Entry DOI: 10.7270/Q2QV3P96
Androgen receptor
(Homo sapiens (Human))
BDBM50122643
(CHEMBL3623122)
Show SMILES [H][C@]12C(=O)N(C(=O)[C@@]1([H])[C@@]1(C)O[C@]2(C)C[C@H]1NC(=O)ON1CCN(C)CC1)c1ccc(C#N)c(c1)C(F)(F)F |r,TLB:16:15:1.7:11|
Show InChI InChI=1S/C24H26F3N5O5/c1-22-11-16(29-21(35)36-31-8-6-30(3)7-9-31)23(2,37-22)18-17(22)19(33)32(20(18)34)14-5-4-13(12-28)15(10-14)24(25,26)27/h4-5,10,16-18H,6-9,11H2,1-3H3,(H,29,35)/t16-,17-,18+,22+,23+/m1/s1
NCI pathway
Reactome pathway
n/an/a 6n/an/an/an/an/an/a
Bristol Myers-Squibb Research and Development
Curated by ChEMBL
Assay Description
Antagonist activity at androgen receptor in human MDA-MB-453 cells assessed as inhibition of DHT-induced PSA expression by alkaline phosphatase repor...
ACS Med Chem Lett 6: 908-12 (2015)
BindingDB Entry DOI: 10.7270/Q2QV3P96